Benzene, (bromomethyl)pentafluoro-
- Formula: C7H2BrF5
- Molecular weight: 260.987
- IUPAC Standard InChIKey: XDEPVFFKOVDUNO-UHFFFAOYSA-N
- CAS Registry Number: 1765-40-8
- Chemical structure:
View 3d structure (requires JavaScript / HTML 5) - Other names: Toluene, α-bromo-2,3,4,5,6-pentafluoro-; α-Bromo-2,3,4,5,6-pentafluorotoluene; (Bromomethyl)pentafluorobenzene; Pentafluorobenzyl bromide; 1-Bromomethylpentafluorobenzene; 2,3,4,5,6-Pentafluorobenzyl bromide; alpha-bromo-2,3,4,5,6-pentafluorotoluene

Phase change data

Data compiled by: Robert L. Brown and Stephen E. Stein
Quantity | Value | Units | Method | Reference | Comment |
---|---|---|---|---|---|
Tboil | 447. to 448. | K | N/A | PCR Inc., 1990 | |
Tboil | 447.7 | K | N/A | Weast and Grasselli, 1989 |

Normal alkane RI, non-polar column, custom temperature program

Column type | Active phase | I | Reference | Comment |
---|---|---|---|---|
Capillary | Polydimethyl siloxanes | 991. | Zenkevich, 2001 | Program: not specified |

References

PCR Inc., 1990
PCR Inc.,
Research Chemicals Catalog 1990-1991, PCR Inc., Gainesville, FL, 1990, 1. [all data]
Weast and Grasselli, 1989
CRC Handbook of Data on Organic Compounds, 2nd Editon, Weast,R.C and Grasselli, J.G., ed(s)., CRC Press, Inc., Boca Raton, FL, 1989, 1. [all data]
Zenkevich, 2001
Zenkevich, I.G.,
Encyclopedia of Chromatography. Derivatization of Acids for GC Analysis, Marcel Dekker, Inc., New York - Basel, 2001, 221. [all data]