Propanoic acid, 2-chloro-, methyl ester
- Formula: C4H7ClO2
- Molecular weight: 122.550
- IUPAC Standard InChIKey: JLEJCNOTNLZCHQ-UHFFFAOYSA-N
- CAS Registry Number: 17639-93-9
- Chemical structure:
View 3d structure (requires JavaScript / HTML 5) - Stereoisomers:
- Other names: Propionic acid, 2-chloro-, methyl ester; α-Chloropropionic acid methyl ester; Methyl α-chloropropionate; Methyl 2-chloropropanoate; Methyl 2-chloropropionate; 2-Chloropropionic acid methyl ester; CH3CHClC(O)OCH3; UN 2933; 2-Chloropropanoic acid methyl ester; NSC 70983

Condensed phase thermochemistry data

Data compiled by: Hussein Y. Afeefy, Joel F. Liebman, and Stephen E. Stein
Quantity | Value | Units | Method | Reference | Comment |
---|---|---|---|---|---|
ΔcH°liquid | -2105. | kJ/mol | Ccb | Schjanberg, 1935 |

Phase change data

Data compiled by: Robert L. Brown and Stephen E. Stein
Quantity | Value | Units | Method | Reference | Comment |
---|---|---|---|---|---|
Tboil | 405.7 | K | N/A | Weast and Grasselli, 1989 |

Kovats' RI, non-polar column, isothermal

Column type | Active phase | Temperature (C) | I | Reference | Comment |
---|---|---|---|---|---|
Capillary | OV-101 | 120. | 781. | Evans, Haken, et al., 1986 | |
Capillary | SE-30 | 100. | 774. | Haken and Korhonen, 1985 | Column length: 25. m; Column diameter: 0.33 mm |
Capillary | SE-30 | 120. | 756. | Haken and Korhonen, 1985 | Column length: 25. m; Column diameter: 0.33 mm |
Capillary | SE-30 | 140. | 790. | Haken and Korhonen, 1985 | Column length: 25. m; Column diameter: 0.33 mm |
Capillary | SE-30 | 80. | 783. | Haken and Korhonen, 1985 | Column length: 25. m; Column diameter: 0.33 mm |
Capillary | OV-101 | 100. | 766. | Horna, Táborský, et al., 1985 | N2; Column length: 19. m; Column diameter: 0.28 mm |
Capillary | OV-101 | 100. | 780. | Haken and Korhonen, 1984 | N2; Column length: 25. m; Column diameter: 0.3 mm |
Capillary | OV-101 | 120. | 781. | Haken and Korhonen, 1984 | N2; Column length: 25. m; Column diameter: 0.3 mm |
Capillary | OV-101 | 80. | 768. | Haken and Korhonen, 1984 | N2; Column length: 25. m; Column diameter: 0.3 mm |
Capillary | OV-101 | 80. | 768. | Komárek, Hornová, et al., 1983 | Column length: 15. m; Column diameter: 0.22 mm |
Packed | E-301 | 170. | 772. | Shashkova, Znamenskaia, et al., 1969 | He, Celite 545 (0.20-0.50 mm); Column length: 2. m |

Kovats' RI, polar column, isothermal

Column type | Active phase | Temperature (C) | I | Reference | Comment |
---|---|---|---|---|---|
Capillary | OV-351 | 100. | 1221. | Haken and Korhonen, 1985 | N2; Column length: 25. m; Column diameter: 0.32 mm |
Capillary | OV-351 | 120. | 1202. | Haken and Korhonen, 1985 | N2; Column length: 25. m; Column diameter: 0.32 mm |
Capillary | OV-351 | 140. | 1236. | Haken and Korhonen, 1985 | N2; Column length: 25. m; Column diameter: 0.32 mm |
Capillary | OV-351 | 160. | 1261. | Haken and Korhonen, 1985 | N2; Column length: 25. m; Column diameter: 0.32 mm |
Capillary | OV-351 | 180. | 1260. | Haken and Korhonen, 1985 | N2; Column length: 25. m; Column diameter: 0.32 mm |
Capillary | OV-351 | 80. | 1202. | Haken and Korhonen, 1985 | N2; Column length: 25. m; Column diameter: 0.32 mm |
Capillary | SP-1000 | 100. | 1198. | Horna, Táborský, et al., 1985 | N2; Column length: 46. m; Column diameter: 0.23 mm |
Packed | Polyethylene Glycol | 170. | 1248. | Shashkova, Znamenskaia, et al., 1969 | He, Celite 545 (0.20-0.50 mm); Column length: 2. m |

References

Schjanberg, 1935
Schjanberg, E.,
Die Verbrennungswarmen und die Refraktionsdaten einiger chlorsubstituierter Fettsauren und Ester.,
Z. Phys. Chem. Abt. A, 1935, 172, 197-233. [all data]
Weast and Grasselli, 1989
CRC Handbook of Data on Organic Compounds, 2nd Editon, Weast,R.C and Grasselli, J.G., ed(s)., CRC Press, Inc., Boca Raton, FL, 1989, 1. [all data]
Evans, Haken, et al., 1986
Evans, M.B.; Haken, J.K.; Tóth, T.,
Solute characterization in gas chromatography by an extension of Kováts retention index system. Dispersion and selectivity indices,
J. Chromatogr., 1986, 351, 155-164, https://doi.org/10.1016/S0021-9673(01)83484-1
. [all data]
Haken and Korhonen, 1985
Haken, J.K.; Korhonen, I.O.O.,
Gas chromatography of homologous esters. XXVII. Retention increments of C1-C18 primary alkanols and their 2-chloropropanoyl and 3-chloropropanoyl derivatives on SE-30 and OV-351 capillary columns,
J. Chromatogr., 1985, 319, 131-142, https://doi.org/10.1016/S0021-9673(01)90548-5
. [all data]
Horna, Táborský, et al., 1985
Horna, A.; Táborský, J.; Churácek, J.; Dufka, O.,
Chromatography of monomers. IV. Gas-liquid chromatographic studies of C1-C6 n-alkyl and C3-C6 isoalkyl acrylates and their hydrogen halide and halogen addition derivatives,
J. Chromatogr., 1985, 348, 141-149, https://doi.org/10.1016/S0021-9673(01)92447-1
. [all data]
Haken and Korhonen, 1984
Haken, J.K.; Korhonen, I.O.O.,
Gas chromatography of homologous esters. XXIV. Studies of chlorinated methyl propanoates and butanoates on a non-polar capillary column,
J. Chromatogr., 1984, 284, 474-477, https://doi.org/10.1016/S0021-9673(01)87849-3
. [all data]
Komárek, Hornová, et al., 1983
Komárek, K.; Hornová, L.; Horna, A.; Churácek, J.,
Glass capillary gas chromatography of homologous series of esters. III. Separation of alkyl halogenopropionates and halogenobutyrates on OV-101,
J. Chromatogr., 1983, 262, 316-320, https://doi.org/10.1016/S0021-9673(01)88112-7
. [all data]
Shashkova, Znamenskaia, et al., 1969
Shashkova, A.A.; Znamenskaia, A.P.; Pas'ko, L.Ya.,
Investigation of esters of odd series halohenated acids with Kovats indices,
Gazovaya Khromatografiya, 1969, 9, 40-47. [all data]