1,3-Benzodioxole, 5-(1-propenyl)-, (Z)-
- Formula: C10H10O2
- Molecular weight: 162.1852
- IUPAC Standard InChIKey: VHVOLFRBFDOUSH-IHWYPQMZSA-N
- CAS Registry Number: 17627-76-8
- Chemical structure:
View 3d structure (requires JavaScript / HTML 5) - Stereoisomers:
- Other names: Benzene, 1,2-(methylenedioxy)-4-propenyl-, (Z)-; α-Isosafrole; cis-Isosafrole; cis-1,2-(Methylenedioxy)-4-propenylbenzene; (Z)-5-(propen-1-yl)-1,3-benzodioxole

Kovats' RI, non-polar column, temperature ramp

Column type | Active phase | I | Reference | Comment |
---|---|---|---|---|
Capillary | DB-5 | 1308. | de Feo, Porta, et al., 1998 | 30. m/0.25 mm/0.25 μm, He, 40. C @ 5. min, 2. K/min, 250. C @ 20. min |

References

de Feo, Porta, et al., 1998
de Feo, V.; Porta, G.D.; Urrunaga Soria, E.; Urrunaga Soria, R.; Senatore, F.,
Composition of the essential oil of Tagetes filifolia Lag.,
Flavour Fragr. J., 1998, 13, 3, 145-147, https://doi.org/10.1002/(SICI)1099-1026(199805/06)13:3<145::AID-FFJ707>3.0.CO;2-Q
. [all data]