Platinate(-1), tri-μ-carbonyl-tricarbonyl- tetrahedro
- Formula: C6O6Pt4-
- Molecular weight: 948.397
- CAS Registry Number: 176180-19-1

Reaction thermochemistry data

Data compiled by: John E. Bartmess
Individual Reactions
C6O6Pt4- + = C8O8Pt4-
By formula: C6O6Pt4- + CO = C8O8Pt4-
Quantity | Value | Units | Method | Reference | Comment |
---|---|---|---|---|---|
ΔrH° | 18.4 ± 6.9 | kcal/mol | N/A | Grushow and Ervin, 1997 | gas phase |

Ion clustering data

Data compiled by: John E. Bartmess

Clustering reactions

C6O6Pt4- + Carbon monoxide = C8O8Pt4-

By formula: C6O6Pt4- + CO = C8O8Pt4-

Quantity Value Units Method Reference Comment
Δr18.4 ± 6.9kcal/molN/AGrushow and Ervin, 1997gas phase

References

Grushow and Ervin, 1997
Grushow, A.; Ervin, K.M.,
Ligand and Metal Binding Energies in Platinum Carbonyl Cluster Anions: Collision Induced Dissociation of PtM- and Ptm(CO)n-,
J. Chem. Phys., 1997, 106, 23, 9580, https://doi.org/10.1063/1.474116
. [all data]