Didesethylflurazepam
- Formula: C17H15ClFN3O
- Molecular weight: 331.772
- IUPAC Standard InChIKey: MVAUDJDXZPBWOW-UHFFFAOYSA-N
- CAS Registry Number: 17617-59-3
- Chemical structure:
View 3d structure (requires JavaScript / HTML 5) - Other names: 2H-1,4-Benzodiazepin-2-one, 1,3-dihydro-1-(2-aminoethyl)-7-chloro-5-(2-fluorophenyl)-; 1-(2-Aminoethyl)-7-chloro-5-(2-fluorophenyl)-1,3-dihydro-2H-1,4-benzodiazepin-2-one; RO 7-1986; 2H-1,4-Benzodiazepin-2-one, 1-(2-aminoethyl)-7-chloro-5-(2-fluorophenyl)-1,3-dihydro-; 2H-1,4-Benzodiazepin-2-one, 1-(2-aminoethyl)-7-chloro-5-(o-fluorophenyl)-1,3-dihydro-; Desalkylflurazepam; Dideethylflurazepam; Dealkylflurazepam; N,N-Bisdesethylflurazepam; Flurazepam M (di-desethyl)

Kovats' RI, non-polar column, isothermal

Column type | Active phase | Temperature (C) | I | Reference | Comment |
---|---|---|---|---|---|
Packed | SE-30 | 250. | 2660. | Schütz, 1982 | N2 |

References

Schütz, 1982
Schütz, H.,
Benzodiazepines, Springer-Verlag, New York, 1982, 438. [all data]