1,5-Cyclooctadiene, (E,E)-
- Formula: C8H12
- Molecular weight: 108.1809
- IUPAC Standard InChIKey: VYXHVRARDIDEHS-GQUYQXFZSA-N
- CAS Registry Number: 17612-50-9
- Chemical structure:
View 3d structure (requires JavaScript / HTML 5) - Stereoisomers:
- Other names: (E,E)-1,5-Cyclooctadiene

Gas phase thermochemistry data

Data compiled by: Hussein Y. Afeefy, Joel F. Liebman, and Stephen E. Stein
Quantity | Value | Units | Method | Reference | Comment |
---|---|---|---|---|---|
ΔfH°gas | 196. | kJ/mol | Chyd | Roth, Adamczak, et al., 1991 |

Phase change data

Data compiled by: Thermodynamics Research Center, NIST Boulder Laboratories, Chris Muzny director
Quantity | Value | Units | Method | Reference | Comment |
---|---|---|---|---|---|
Tfus | 211. | K | N/A | Ziegler and Wilms, 1948 | Uncertainty assigned by TRC = 5. K; stereochemistry is assumed |

Reaction thermochemistry data

Data compiled by: Hussein Y. Afeefy, Joel F. Liebman, and Stephen E. Stein
Individual Reactions
By formula: 2H2 + C8H12 = C8H16
Quantity | Value | Units | Method | Reference | Comment |
---|---|---|---|---|---|
ΔrH° | -320. ± 0.4 | kJ/mol | Chyd | Roth, Adamczak, et al., 1991 | liquid phase |

References

Roth, Adamczak, et al., 1991
Roth, W.R.; Adamczak, O.; Breuckmann, R.; Lennartz, H.-W.; Boese, R.,
Die Berechnung von Resonanzenergien; das MM2ERW-Kraftfeld,
Chem. Ber., 1991, 124, 2499-2521. [all data]
Ziegler and Wilms, 1948
Ziegler, K.; Wilms, H.,
Stereoisomerism of Eight-membered Cycloolefin Rings,
Naturwissenschaften, 1948, 35, 157-8. [all data]