Fucosterol
- Formula: C29H48O
- Molecular weight: 412.6908
- IUPAC Standard InChIKey: OSELKOCHBMDKEJ-LBMKRXITSA-N
- CAS Registry Number: 17605-67-3
- Chemical structure:
View 3d structure (requires JavaScript / HTML 5) - Stereoisomers:
- Other names: Stigmasta-5,24(28)-dien-3-ol, (3β,24E)-; Stigmasta-5,24(28)-dien-3β-ol, (E)-; trans-24-Ethylidenecholesterol; Fucosterin; 28-Isofucosterol; 24(E)-Ethylidenecholest-5-en-3β-ol

Kovats' RI, non-polar column, isothermal

Column type | Active phase | Temperature (C) | I | Reference | Comment |
---|---|---|---|---|---|
Capillary | DB-1 | 270. | 3273.74 | Stránský, Valterová, et al., 2001 | 30. m/0.25 mm/0.25 μm, H2 |
Capillary | Methyl Silicone | 250. | 3305. | Shlyakhov, 1984 |

Normal alkane RI, non-polar column, custom temperature program

Column type | Active phase | I | Reference | Comment |
---|---|---|---|---|
Capillary | 3280. | El-Shazily, Hafez, et al., 2004 | Program: not specified |

References

Stránský, Valterová, et al., 2001
Stránský, K.; Valterová, I.; Fiedler, P.,
Nonsaponifiable lipid components of the pollen of elder (Sambucus nigra L.),
J. Chromatogr. A, 2001, 936, 1-2, 173-181, https://doi.org/10.1016/S0021-9673(01)01313-9
. [all data]
Shlyakhov, 1984
Shlyakhov, A.F.,
Gas chromatography in organic geochemistry, Nedra, Moscow, 1984, 221. [all data]
El-Shazily, Hafez, et al., 2004
El-Shazily, A.M.; Hafez, S.S.; Wink, M.,
Comparative study of the essential oils and extracts of Achillea fragrantissima (Forssk.) Sch. Bip. and Achillea santolina L. (Asteraceae) from Egypt,
Pharmazie, 2004, 59, 226-230. [all data]