Acetic acid, diphenyl-, anhydride

Condensed phase thermochemistry data

Data compiled by: Hussein Y. Afeefy, Joel F. Liebman, and Stephen E. Stein

Quantity Value Units Method Reference Comment
Δcsolid-3308.4kcal/molCcbVerkade, Coops, et al., 1915Corresponding Δfsolid = -76.5 kcal/mol (simple calculation by NIST; no Washburn corrections)

References

Verkade, Coops, et al., 1915
Verkade, P.E.; Coops, J., Jr.; Hartman, H., Calorimetric researches. I. The standardization of a calorimetric system; comparison of the heats of combustion of substances used in the standardization: bonzoic acid and napthalene, Recl. Trav. Chim. Pays-Bas, 1915, 41, 241-277. [all data]