2-Methyl-1-octen-3-yne
- Formula: C9H14
- Molecular weight: 122.2075
- IUPAC Standard InChIKey: FPKTZBDAOSTAHN-UHFFFAOYSA-N
- CAS Registry Number: 17603-76-8
- Chemical structure:
View 3d structure (requires JavaScript / HTML 5) - Other names: 2-Methyl-1-octene-3-yne; 1-Octen-3-yne, 2-methyl-; 2-Methyl-oct-1-en-3-yne

Phase change data

Data compiled by: Robert L. Brown and Stephen E. Stein
Reduced pressure boiling point
Tboil (K) | Pressure (bar) | Reference |
---|---|---|
340. to 342. | 0.048 | Farchan Laboratories, 1990 |

Gas phase ion energetics data

Data compiled by: Sharon G. Lias, Rhoda D. Levin, and Sherif A. Kafafi

Ionization energy determinations

IE (eV) Method Reference
8.57 ± 0.01PECarlier, Mouvier, et al., 1979

Normal alkane RI, non-polar column, temperature ramp

View large format table.

Column type Active phase I Reference Comment
CapillaryHP-5981.Wang, Yang, et al., 200630. m/0.25 mm/0.25 μm, He, 60. C @ 2. min, 10. K/min, 250. C @ 10. min

References

Farchan Laboratories, 1990
Farchan Laboratories,
Research Chemicals Catalog, Farchan Laboratories, Gainesville, FL, 1990, 91. [all data]