C2H3D3O
- Formula: C2H3D3O
- Molecular weight: 49.0869
- IUPAC Standard InChIKey: LFQSCWFLJHTTHZ-FIBGUPNXSA-N
- CAS Registry Number: 1759-87-1
- Chemical structure:
View 3d structure (requires JavaScript / HTML 5) - Isotopologues:

Reaction thermochemistry data

Data compiled by: John E. Bartmess
Individual Reactions
C2H2D5O- + =
By formula: C2H2D5O- + H+ = C2H3D3O
Quantity | Value | Units | Method | Reference | Comment |
---|---|---|---|---|---|
ΔrH° | 1580. ± 9.6 | kJ/mol | G+TS | Dang, Motell, et al., 1993 | gas phase; CIDC in SIFT at 30 V: 0.20 ± 0.15 kcal/mol weaker than protio |
Quantity | Value | Units | Method | Reference | Comment |
ΔrG° | 1552. ± 9.2 | kJ/mol | CIDC | Dang, Motell, et al., 1993 | gas phase; CIDC in SIFT at 30 V: 0.20 ± 0.15 kcal/mol weaker than protio |

Gas phase ion energetics data

Data compiled by: John E. Bartmess
De-protonation reactions
C2H2D5O- + =
By formula: C2H2D5O- + H+ = C2H3D3O
Quantity | Value | Units | Method | Reference | Comment |
---|---|---|---|---|---|
ΔrH° | 1580. ± 9.6 | kJ/mol | G+TS | Dang, Motell, et al., 1993 | gas phase; CIDC in SIFT at 30 V: 0.20 ± 0.15 kcal/mol weaker than protio |
Quantity | Value | Units | Method | Reference | Comment |
ΔrG° | 1552. ± 9.2 | kJ/mol | CIDC | Dang, Motell, et al., 1993 | gas phase; CIDC in SIFT at 30 V: 0.20 ± 0.15 kcal/mol weaker than protio |

References

Dang, Motell, et al., 1993
Dang, T.T.; Motell, E.L.; Travers, M.J.; Clifford, E.P.; Ellison, G.B.; Depuy, C.H.; Bierbaum, V.M.,
Experimental and Computational Studies of Deuterated Ethanols - Gas-Phase Acidities, Electron Affinities and Bond Dissociation Energies,
Int. J. Mass Spectrom. Ion Proc., 1993, 123, 3, 171, https://doi.org/10.1016/0168-1176(93)87096-B
. [all data]