Cyclohexene, 1,6-dimethyl-
- Formula: C8H14
- Molecular weight: 110.1968
- IUPAC Standard InChIKey: AXKAIBQIFBAAMK-UHFFFAOYSA-N
- CAS Registry Number: 1759-64-4
- Chemical structure:
View 3d structure (requires JavaScript / HTML 5) - Other names: 1,6-Dimethylcyclohexene

Normal alkane RI, non-polar column, custom temperature program

Column type | Active phase | I | Reference | Comment |
---|---|---|---|---|
Capillary | Methyl Silicone | 838. | Zenkevich, 2000 | Program: not specified |

Phase change data

Data compiled by: Thermodynamics Research Center, NIST Boulder Laboratories, Chris Muzny director
Quantity | Value | Units | Method | Reference | Comment |
---|---|---|---|---|---|
Tboil | 398. | K | N/A | Knoevenagel, 1897 | Uncertainty assigned by TRC = 8. K; isomer not identified |

References

Zenkevich, 2000
Zenkevich, I.G.,
Mutual Correlation between Gas Chromatographic Retention Indices of Unsaturated and Saturated Hydrocarbons found by Molecular Dynamics,
Z. Anal. Chem., 2000, 55, 10, 1091-1097. [all data]