Spiro(4,4)nonane
- Formula: C9H16
- Molecular weight: 124.2233
- IUPAC Standard InChIKey: PHICBFWUYUCFKS-UHFFFAOYSA-N
- CAS Registry Number: 175-93-9
- Chemical structure:
View 3d structure (requires JavaScript / HTML 5) - Permanent link for this species. Use this link for bookmarking this species for future reference.

Condensed phase thermochemistry data

Data compiled by: Hussein Y. Afeefy, Joel F. Liebman, and Stephen E. Stein
Quantity | Value | Units | Method | Reference | Comment |
---|---|---|---|---|---|
ΔfH°liquid | -144. ± 1. | kJ/mol | Ccb | Kozin, Mirzaeva, et al., 1964 | |
Quantity | Value | Units | Method | Reference | Comment |
ΔcH°liquid | -5684. ± 1. | kJ/mol | Ccb | Kozin, Mirzaeva, et al., 1964 | Corresponding ΔfHºliquid = -144. kJ/mol (simple calculation by NIST; no Washburn corrections) |

Phase change data

Data compiled by: William E. Acree, Jr., James S. Chickos
Quantity | Value | Units | Method | Reference | Comment |
---|---|---|---|---|---|
ΔvapH° | 44.5 ± 0.6 | kJ/mol | GS | Verevkin, 2002 | Based on data from 278. to 313. K. |

References

Kozin, Mirzaeva, et al., 1964
Kozin, M.P.; Mirzaeva, A.K.; Sosina, I.E.; Elagina, N.V.; Skuratov, S.M.,
The heats of formation of spiro hydrocarbons,
Dokl. Phys. Chem. (Engl. Transl.), 1964, 155, 375-377. [all data]
Verevkin, 2002
Verevkin, Sergey P.,
Improved Benson Increments for the Estimation of Standard Enthalpies of Formation and Enthalpies of Vaporization of Alkyl Ethers, Acetals, Ketals, and Ortho Esters,
J. Chem. Eng. Data, 2002, 47, 5, 1071-1097, https://doi.org/10.1021/je020023o
. [all data]