Benzene, 2-ethyl-1,4-dimethyl-
- Formula: C10H14
- Molecular weight: 134.2182
- IUPAC Standard InChIKey: AXIUBBVSOWPLDA-UHFFFAOYSA-N
- CAS Registry Number: 1758-88-9
- Chemical structure:
View 3d structure (requires JavaScript / HTML 5) - Other names: p-Xylene, 2-ethyl-; 1,4-Dimethyl-2-ethylbenzene; 2-Ethyl-p-xylene; 2-Ethyl-1,4-dimethylbenzene; 2,5-Dimethylethylbenzene

Kovats' RI, non-polar column, isothermal

Column type | Active phase | Temperature (C) | I | Reference | Comment |
---|---|---|---|---|---|
Capillary | OV-1 | 100. | 1068.5 | Zhu, Zhang, et al., 1999 | Column length: 50. m; Column diameter: 0.25 mm |
Capillary | CP Sil 2 | 80. | 1069.5 | Estel, Mohnke, et al., 1995 | 100. m/0.25 mm/0.25 μm |
Capillary | HP-1 | 60. | 1060. | Zhang, Li, et al., 1992 | N2; Column length: 25. m; Column diameter: 0.20 mm |
Capillary | HP-1 | 60. | 1060. | Zhang, Li, et al., 1992 | N2; Column length: 25. m; Column diameter: 0.20 mm |
Capillary | HP-1 | 100. | 1068. | Zhang, Li, et al., 1992 | N2; Column length: 25. m; Column diameter: 0.20 mm |
Capillary | HP-1 | 100. | 1069. | Zhang, Li, et al., 1992 | N2; Column length: 25. m; Column diameter: 0.20 mm |
Capillary | OV-1 | 100. | 1067.2 | Matisová and Kurán, 1990 | 52. m/0.25 mm/0.38 μm, N2 |
Capillary | OV-1 | 100. | 1066.7 | Matisová and Kurán, 1990 | 52. m/0.25 mm/0.38 μm, H2 |
Capillary | PONA | 100. | 1067.7 | Matisová and Kurán, 1990 | 50. m/0.2 mm/0.5 μm, H2 |
Capillary | OV-101 | 100. | 1067. | Matisová, Kovacicová, et al., 1989 | He; Column length: 50. m; Column diameter: 0.20 mm |
Capillary | OV-101 | 120. | 1073. | Matisová, Moravcová, et al., 1988 | N2; Column length: 278. m; Column diameter: 0.25 mm |
Capillary | Apolane | 120. | 1089. | Matisová, Moravcová, et al., 1988 | N2; Column length: 200. m; Column diameter: 0.25 mm |
Capillary | OV-101 | 100. | 1067. | Matisová, Rukríglová, et al., 1988 | H2; Column length: 278. m; Column diameter: 0.25 mm |
Capillary | OV-101 | 100. | 1067. | Matisová, Rukríglová, et al., 1988 | H2; Column length: 278. m; Column diameter: 0.25 mm |
Capillary | OV-101 | 100. | 1069. | Matisová, Rukríglová, et al., 1988 | H2; Column length: 278. m; Column diameter: 0.25 mm |
Capillary | OV-101 | 100. | 1069. | Matisová, Rukríglová, et al., 1988 | H2; Column length: 278. m; Column diameter: 0.25 mm |
Capillary | SE-30 | 70. | 1059.0 | Tóth, 1983 | N2; Column length: 15. m; Column diameter: 0.25 mm |
Capillary | Squalane | 86. | 1054.8 | Nabivach and Kirilenko, 1979 | N2; Column length: 50. m |
Capillary | Squalane | 100. | 1062. | Engewald and Wennrich, 1976 | N2; Column length: 100. m; Column diameter: 0.23 mm |
Capillary | Squalane | 80. | 1054.29 | Soják and Rijks, 1976 | H2; Column length: 100. m; Column diameter: 0.25 mm |
Capillary | SE-30 | 130. | 1081. | Mitra, Mohan, et al., 1974 | H2; Column length: 6.1 m; Column diameter: 3.18 mm |
Capillary | SE-30 | 140. | 1080. | Mitra, Mohan, et al., 1974 | H2; Column length: 6.1 m; Column diameter: 3.18 mm |
Capillary | SE-30 | 150. | 1085. | Mitra, Mohan, et al., 1974 | H2; Column length: 6.1 m; Column diameter: 3.18 mm |
Capillary | SE-30 | 160. | 1089. | Mitra, Mohan, et al., 1974 | H2; Column length: 6.1 m; Column diameter: 3.18 mm |
Capillary | SE-30 | 65. | 1060.5 | Svob and Deur-Siftar, 1974 | He; Column length: 25.5 m; Column diameter: 0.5 mm |
Capillary | Squalane | 100. | 1060.0 | Svob and Deur-Siftar, 1974 | He; Column length: 10.5 m; Column diameter: 0.25 mm |

Kovats' RI, non-polar column, temperature ramp

Column type | Active phase | I | Reference | Comment |
---|---|---|---|---|
Capillary | DB-5 | 1086.9 | Wang, Fingas, et al., 1994 | 30. m/0.32 mm/0.25 μm, He, 50. C @ 2. min, 6. K/min; Tend: 300. C |
Capillary | OV-101 | 1061. | Hayes and Pitzer, 1982 | 110. m/0.25 mm/0.20 μm, He, 1. K/min; Tstart: 35. C; Tend: 200. C |
Capillary | Apiezon L | 1090. | Louis, 1971 | N2, 1. K/min; Column length: 50. m; Column diameter: 0.25 mm; Tstart: 60. C |

Kovats' RI, non-polar column, custom temperature program

Column type | Active phase | I | Reference | Comment |
---|---|---|---|---|
Capillary | Petrocol DH-100 | 1068. | Haagen-Smit Laboratory, 1997 | He; Column length: 100. m; Column diameter: 0.2 mm; Program: 5C(10min) => 5C/min => 50C(48min) => 1.5C/min => 195C(91min) |
Capillary | DB-1 | 1067. | Hoekman, 1993 | 60. m/0.32 mm/1.0 μm, He; Program: -40 C for 12 min; -40 - 125 C at 3 deg.min; 125-185 C at 6 deg/min; 185 - 220 C at 20 deg/min; hold 220 C for 2 min |

Kovats' RI, polar column, isothermal

Column type | Active phase | Temperature (C) | I | Reference | Comment |
---|---|---|---|---|---|
Capillary | Carbowax 20M | 150. | 1307. | Egazaryants and Maximov, 1998 | He; Column length: 15. m; Column diameter: 0.5 mm |
Capillary | PEG-20M | 70. | 1343.5 | Tóth, 1983 | N2; Column length: 30. m; Column diameter: 0.3 mm |
Capillary | Carbowax 20M | 100. | 1335.0 | Engewald and Wennrich, 1976 | N2; Column length: 100. m; Column diameter: 0.23 mm |
Capillary | Carbowax 20M | 90. | 1321.1 | Döring, Estel, et al., 1974 | Column length: 100. m; Column diameter: 0.2 mm |

Van Den Dool and Kratz RI, non-polar column, temperature ramp

Column type | Active phase | I | Reference | Comment |
---|---|---|---|---|
Capillary | Petrocol DH | 1068.8 | Censullo, Jones, et al., 2003 | 50. m/0.25 mm/0.5 μm, He, 35. C @ 10. min, 3. K/min, 200. C @ 10. min |
Capillary | PONA | 1059.6 | Martos, Saraullo, et al., 1997 | 50. m/0.2 mm/0.5 μm, 35. C @ 0.5 min, 1. K/min, 220. C @ 8. min |
Capillary | PONA | 1063.0 | Martos, Saraullo, et al., 1997 | 50. m/0.2 mm/0.5 μm, 35. C @ 0.5 min, 1. K/min, 220. C @ 8. min |
Capillary | Ultra-1 | 1062. | Olson, Sinkevitch, et al., 1992 | 4. K/min; Tstart: -40. C; Tend: 230. C |
Capillary | Petrocol DH | 1062.32 | White, Douglas, et al., 1992 | 100. m/0.25 mm/0.5 μm, He, 1. K/min; Tstart: 30. C; Tend: 220. C |
Capillary | Petrocol DH | 1063.12 | White, Douglas, et al., 1992 | 100. m/0.25 mm/0.5 μm, He, 1. K/min; Tstart: 30. C; Tend: 220. C |
Capillary | Petrocol DH | 1063. | White, Hackett, et al., 1992 | 100. m/0.25 mm/0.5 μm, He, 1. K/min; Tstart: 30. C; Tend: 220. C |
Capillary | OV-101 | 1061. | Hayes and Pitzer, 1981 | 108. m/0.25 mm/0.2 μm, 1. K/min; Tstart: 35. C; Tend: 200. C |

Van Den Dool and Kratz RI, non-polar column, custom temperature program

Column type | Active phase | I | Reference | Comment |
---|---|---|---|---|
Capillary | BPX-5 | 1093. | Cardeal, da Silva, et al., 2006 | 30. m/0.25 mm/0.25 μm; Program: 35C(5min) => 3C/min => 210C => 40C/min => 240C (4min) |
Capillary | Methyl Silicone | 1074.60 | Hassoun, Pilling, et al., 1999 | 50. m/0.25 mm/1. μm, He; Program: -50C(2min) => 49.9C/min => 35C(10min) => 3C/min => 200C(2min) => 40C/min => 240C(30min) |

Van Den Dool and Kratz RI, polar column, temperature ramp

Column type | Active phase | I | Reference | Comment |
---|---|---|---|---|
Capillary | CP-Wax 52CB | 1339. | Mahadevan and Farmer, 2006 | 60. C @ 5. min, 4. K/min, 220. C @ 30. min; Column length: 50. m; Column diameter: 0.32 mm |
Capillary | DB-Wax | 1364. | Le Guen, Prost, et al., 2000 | 60. m/0.32 mm/0.5 μm, He, 40. C @ 2. min, 4. K/min, 250. C @ 10. min |

Normal alkane RI, non-polar column, isothermal

Column type | Active phase | Temperature (C) | I | Reference | Comment |
---|---|---|---|---|---|
Capillary | OV-101 | 100. | 1064. | Tian, 1993 | Column length: 50. m; Column diameter: 0.20 mm |
Capillary | OV-101 | 120. | 1073. | Tian, 1993 | Column length: 50. m; Column diameter: 0.20 mm |
Capillary | Squalane | 95.4 | 1049. | Sojak and Vigdergauz, 1978 | H2 |
Capillary | Squalane | 110. | 1062. | Papazova and Pankova, 1975 | N2; Column length: 100. m; Column diameter: 0.25 mm |
Capillary | Squalane | 130. | 1063. | Papazova and Pankova, 1975 | N2; Column length: 100. m; Column diameter: 0.25 mm |

Normal alkane RI, non-polar column, temperature ramp

Column type | Active phase | I | Reference | Comment |
---|---|---|---|---|
Capillary | Polydimethyl siloxane: CP-Sil 5 CB | 1071. | Bramston-Cook, 2013 | 60. m/0.25 mm/1.0 μm, Helium, 45. C @ 1.45 min, 3.6 K/min, 210. C @ 2.72 min |
Capillary | HP-5 MS | 1074. | Kotowska, Zalikowski, et al., 2012 | 30. m/0.25 mm/0.25 μm, Helium, 35. C @ 5. min, 3. K/min, 300. C @ 15. min |
Capillary | Petrocol DH | 1068. | Supelco, 2012 | 100. m/0.25 mm/0.50 μm, Helium, 20. C @ 15. min, 15. K/min, 220. C @ 30. min |
Capillary | PONA | 1070. | Zhang, Ding, et al., 2009 | 50. m/0.20 mm/0.50 μm, Nitrogen, 35. C @ 15. min, 2. K/min, 200. C @ 10. min |
Capillary | OV-1 | 1066. | Orav, Kailas, et al., 1999 | 2. K/min; Tstart: 50. C; Tend: 160. C |
Capillary | HP-5 | 1085.2 | Wang and Fingas, 1995 | 30. m/0.25 mm/0.25 μm, He, 35. C @ 2. min, 10. K/min, 300. C @ 10. min |
Capillary | DB-1 | 1051. | Ciccioli, Cecinato, et al., 1992 | 60. m/0.32 mm/1.2 μm, He, 30. C @ 10. min, 3. K/min; Tend: 240. C |
Capillary | CP Sil 5 CB | 1060. | Hartgers, Damste, et al., 1992 | 25. m/0.32 mm/0.45 μm, He, 0. C @ 5. min, 3. K/min, 320. C @ 10. min |

Normal alkane RI, non-polar column, custom temperature program

Column type | Active phase | I | Reference | Comment |
---|---|---|---|---|
Capillary | HP-5 MS | 1072. | Kotowska, Zalikowski, et al., 2012 | 30. m/0.25 mm/0.25 μm, Helium; Program: not specified |
Capillary | Polydimethyl siloxane with 5 % Ph groups | 1077. | Robinson, Adams, et al., 2012 | Program: not specified |
Capillary | Polydimethyl siloxane with 5 % Ph groups | 1083. | Robinson, Adams, et al., 2012 | Program: not specified |
Capillary | HP-5MS | 1077. | Vichi, Pizzale, et al., 2005 | 30. m/0.25 mm/0.25 μm; Program: 40C(3min) => 4C/min => 75C => 8C/min => 250C |
Capillary | Polymethylsiloxane, (PMS-20000) | 1059. | Cornwell and Cordano, 2003 | Program: not specified |
Capillary | Methyl Silicone | 1068. | Spieksma, 1999 | Program: not specified |
Capillary | SE-30 | 1059. | Xiuhua, Zhang, et al., 1996 | Program: not specified |
Capillary | SE-30 | 1064. | Xiuhua, Zhang, et al., 1996 | Program: not specified |
Capillary | OV-101 | 1067. | Matisová, Juranyiová, et al., 1991 | 52. m/0.25 mm/0.38 μm, H2; Program: 70 - 160 C at 1.5 deg/min; 160 - 280 C at 15 deg/min 15 min at 280 C |
Capillary | OV-1, SE-30, Methyl silicone, SP-2100, OV-101, DB-1, etc. | 1073. | Waggott and Davies, 1984 | Hydrogen; Column length: 50. m; Column diameter: 0.32 mm; Program: not specified |
Capillary | OV-1, SE-30, Methyl silicone, SP-2100, OV-101, DB-1, etc. | 1066. | Waggott and Davies, 1984 | Hydrogen; Column length: 50. m; Column diameter: 0.32 mm; Program: not specified |

Normal alkane RI, polar column, isothermal

Column type | Active phase | Temperature (C) | I | Reference | Comment |
---|---|---|---|---|---|
Capillary | Carbowax 20M | 90. | 1321. | Sutter, Peterson, et al., 1997 |

Normal alkane RI, polar column, custom temperature program

Column type | Active phase | I | Reference | Comment |
---|---|---|---|---|
Capillary | BP-20 | 1323. | Rodrigues, Caldera, et al., 2008 | 30. m/0.25 mm/0.25 μm, Helium; Program: 40 0C (1 min) 2 0C/min -> 100 0C (2 min) 1.7 0C/min -> 180 0C (1 min) 25 0C/min -> 220 0C (10 min) |
Capillary | Supelcowax-10 | 1341. | Vichi, Pizzale, et al., 2005 | 30. m/0.25 mm/0.25 μm; Program: 40C(3min) => 4C/min => 75C => 8C/min => 250C |
Capillary | Carbowax 20M | 1344. | Cornwell and Cordano, 2003 | Program: not specified |
Capillary | Carbowax 20M | 1321. | Ivanciuc, Ivanciuc, et al., 2001 | Program: not specified |
Capillary | PEG-20M | 1344. | Xiuhua, Zhang, et al., 1996 | Program: not specified |

Condensed phase thermochemistry data

Data compiled by: Hussein Y. Afeefy, Joel F. Liebman, and Stephen E. Stein
Quantity | Value | Units | Method | Reference | Comment |
---|---|---|---|---|---|
ΔfH°liquid | -84.8 ± 1.2 | kJ/mol | Ccb | Good, 1975 | |
ΔfH°liquid | -85.3 ± 2.6 | kJ/mol | Ccb | Prosen, Johnson, et al., 1946 | |
Quantity | Value | Units | Method | Reference | Comment |
ΔcH°liquid | -5851.1 ± 1.1 | kJ/mol | Ccb | Good, 1975 | Corresponding ΔfHºliquid = -84.81 kJ/mol (simple calculation by NIST; no Washburn corrections) |
ΔcH°liquid | -5850.7 ± 2.6 | kJ/mol | Ccb | Prosen, Johnson, et al., 1946 | Corresponding ΔfHºliquid = -85.19 kJ/mol (simple calculation by NIST; no Washburn corrections) |

Phase change data

Data compiled as indicated in comments:
BS - Robert L. Brown and Stephen E. Stein
TRC - Thermodynamics Research Center, NIST Boulder Laboratories, Chris Muzny director
AC - William E. Acree, Jr., James S. Chickos
Quantity | Value | Units | Method | Reference | Comment |
---|---|---|---|---|---|
Tboil | 460. ± 1. | K | AVG | N/A | Average of 12 values; Individual data points |
Quantity | Value | Units | Method | Reference | Comment |
Tfus | 219.41 | K | N/A | Birch, Dean, et al., 1949 | Uncertainty assigned by TRC = 0.2 K; TRC |
Quantity | Value | Units | Method | Reference | Comment |
ΔvapH° | 52.6 | kJ/mol | N/A | Reid, 1972 | AC |
Enthalpy of vaporization
ΔvapH (kJ/mol) | Temperature (K) | Method | Reference | Comment |
---|---|---|---|---|
48.0 | 353. | A | Stephenson and Malanowski, 1987 | Based on data from 338. to 490. K.; AC |
48.7 | 313. | N/A | Stull, 1947 | Based on data from 299. to 440. K.; AC |

References

Zhu, Zhang, et al., 1999
Zhu, X.; Zhang, L.; Chen, J.; Wang, L.; Che, X.,
The application quantitative structure-retention relationship of GC to aid MS qualitative analysis,
Chin. J. Chromatogr., 1999, 17, 4, 351-353. [all data]
Estel, Mohnke, et al., 1995
Estel, D.; Mohnke; Biermans; Rotzsche,
The analysis of C4-C11 hydrocarbons in naphtha and reformate with a new apolar fused silica column,
J. Hi. Res. Chromatogr., 1995, 18, 7, 403-412, https://doi.org/10.1002/jhrc.1240180703
. [all data]
Zhang, Li, et al., 1992
Zhang, M.J.; Li, S.D.; Chen, B.J.,
Compositional studies of high-temperature coal tar by GC/FTIR analysis of light oil fractions,
Chromatographia, 1992, 33, 3/4, 138-146, https://doi.org/10.1007/BF02275894
. [all data]
Matisová and Kurán, 1990
Matisová, E.; Kurán, P.,
Reproducibility of retention indices measurement of alkylbenzenes on crosslinked methyl silicone phase fused silica capillaries,
Chromatographia, 1990, 30, 5/6, 328-332, https://doi.org/10.1007/BF02319717
. [all data]
Matisová, Kovacicová, et al., 1989
Matisová, E.; Kovacicová, E.; Ha, P.T.; Kolek, E.; Engewald, W.,
Identification of alkylbenzenes up to C12 by capillary gas chromatography-mass spectrometry. II. Retention indices on OV-101 columns and retention-molecular structure correlations,
J. Chromatogr., 1989, 475, 2, 113-123, https://doi.org/10.1016/S0021-9673(01)89667-9
. [all data]
Matisová, Moravcová, et al., 1988
Matisová, E.; Moravcová, A.; Krupcík; Cellár, P.; Leclercq, P.A.,
Problems with the reproducibility of retention data on capillary columns with hydrocarbon C87 as the stationary phase,
J. Chromatogr., 1988, 454, 65-71, https://doi.org/10.1016/S0021-9673(00)88602-1
. [all data]
Matisová, Rukríglová, et al., 1988
Matisová, E.; Rukríglová, M.; Krupcík, J.; Kovacicová, E.; Holotík, S.,
Identification of alkylbenzenes up to C12 by capillary gas chromatography and combined gas chromatography-mass spectrometry. I. OV-101 as stationary phase,
J. Chromatogr., 1988, 455, 301-309, https://doi.org/10.1016/S0021-9673(01)82129-4
. [all data]
Tóth, 1983
Tóth, T.,
Use of capillary gas chromatography in collecting retention and chemical information for the analysis of complex petrochemical mixtures,
J. Chromatogr., 1983, 279, 157-165, https://doi.org/10.1016/S0021-9673(01)93614-3
. [all data]
Nabivach and Kirilenko, 1979
Nabivach, V.M.; Kirilenko, A.V.,
The use of retention indices for identifying the components of crude benzene,
Solid Fuel Chem. (Engl. Transl.), 1979, 13, 3, 82-87. [all data]
Engewald and Wennrich, 1976
Engewald, W.; Wennrich, L.,
Molekülstruktur und Retentionsverhalten. VIII. Zum Retentionsverhalten höherer Alkylbenzole bei der Gas-Verteilungs-Chromatographie,
Chromatographia, 1976, 9, 11, 540-547, https://doi.org/10.1007/BF02275960
. [all data]
Soják and Rijks, 1976
Soják, L.; Rijks, J.A.,
Capillary gas chromatography of alkylbenzenes. I. Some problems encountered with the precision of the retention indcies of alkylbenzenes,
J. Chromatogr., 1976, 119, 505-521, https://doi.org/10.1016/S0021-9673(00)86812-0
. [all data]
Mitra, Mohan, et al., 1974
Mitra, G.D.; Mohan, G.; Sinha, A.,
Gas chromatographic analysis of complex hydrocarbon mixtures,
J. Chromatogr. A, 1974, 91, 633-648, https://doi.org/10.1016/S0021-9673(01)97944-0
. [all data]
Svob and Deur-Siftar, 1974
Svob, V.; Deur-Siftar, D.,
Kovats Retention Indices in the Identification of Alkylbenzene Degradation Products,
J. Chromatogr., 1974, 91, 677-689, https://doi.org/10.1016/S0021-9673(01)97947-6
. [all data]
Wang, Fingas, et al., 1994
Wang, Z.; Fingas, M.; Li, K.,
Fractionation of a light crude oil and identification and quantitation of aliphatic, aromatic, and biomarker comopunds by GC-FID and GC-MS, Part II,
J. Chromatogr. Sci., 1994, 32, 9, 367-382, https://doi.org/10.1093/chromsci/32.9.367
. [all data]
Hayes and Pitzer, 1982
Hayes, P.C., Jr.; Pitzer, E.W.,
Characterizing petroleum- and shale-derived jet fuel distillates via temperature-programmed Kováts indices,
J. Chromatogr., 1982, 253, 179-198, https://doi.org/10.1016/S0021-9673(01)88376-X
. [all data]
Louis, 1971
Louis, R.,
Kovats-index-tafeln zur gaschromatographischen analyse von kohlenwasserstoffgemischen,
Erdoel Kohle Erdgas Petrochem., 1971, 24, 2, 88-94. [all data]
Haagen-Smit Laboratory, 1997
Haagen-Smit Laboratory,
Procedure for the detailed hydrocarbon analysis of gasolines by single column high efficiency (capillary) column gas chromatography, SOP NO. MLD 118, Revision No. 1.1, California Environmental Protection Agency, Air Resources Board, El Monte, California, 1997, 22. [all data]
Hoekman, 1993
Hoekman, S.K.,
Improved gas chromatography procedure for speciated hydrocarbon measurements of vehicle emissions,
J. Chromatogr., 1993, 639, 2, 239-253, https://doi.org/10.1016/0021-9673(93)80260-F
. [all data]
Egazaryants and Maximov, 1998
Egazaryants, S.V.; Maximov, A.L.,
Analysis of Gasoline Fractions by Capillary GC
in 20th International Symposium on Capillary Chromatography, 1998, 1-6. [all data]
Döring, Estel, et al., 1974
Döring, C.E.; Estel, D.; Fischer, R.,
Kapillar-gaschromatographische Charakterisierung von C10-bis C12-Aromaten,
J. Prakt. Chem., 1974, 316, 1, 1-12, https://doi.org/10.1002/prac.19743160102
. [all data]
Censullo, Jones, et al., 2003
Censullo, A.C.; Jones, D.R.; Wills, M.T.,
Speciation of the volatile organic compounds (VOCs) in solventborne aerosol coatings by solid phase microextraction-gas chromatography,
J. Coat. Technol., 2003, 75, 936, 47-53, https://doi.org/10.1007/BF02697922
. [all data]
Martos, Saraullo, et al., 1997
Martos, P.A.; Saraullo, A.; Pawliszyn, J.,
Estimation of air/coating distribution coefficients for solid phase microextraction using retention indexes from linear temperature-programmed capillary gas chromatography. Application to the sampling and analysis of total petroleum hydrocarbons in air,
Anal. Chem., 1997, 69, 3, 402-408, https://doi.org/10.1021/ac960633p
. [all data]
Olson, Sinkevitch, et al., 1992
Olson, K.L.; Sinkevitch, R.M.; Sloane, T.M.,
Speciation and Quantitation of Hydrocarbons in Gasoline Engine Exhaust,
J. Chromatogr. Sci., 1992, 30, 12, 500-508, https://doi.org/10.1093/chromsci/30.12.500
. [all data]
White, Douglas, et al., 1992
White, C.M.; Douglas, L.J.; Hackett, J.P.; Anderson, R.R.,
Characterization of synthetic gasoline from the chloromethane-zeolite reaction,
Energy Fuels, 1992, 6, 1, 76-82, https://doi.org/10.1021/ef00031a012
. [all data]
White, Hackett, et al., 1992
White, C.M.; Hackett, J.; Anderson, R.R.; Kail, S.; Spock, P.S.,
Linear temperature programmed retention indices of gasoline range hydrocarbons and chlorinated hydrocarbons on cross-linked polydimethylsiloxane,
J. Hi. Res. Chromatogr., 1992, 15, 2, 105-120, https://doi.org/10.1002/jhrc.1240150211
. [all data]
Hayes and Pitzer, 1981
Hayes, P.C., Jr.; Pitzer, E.W.,
Kovats indices as a tool in characterizing hydrocarbon fuels in temperature programmed glass capillary gas chromatography. Part 1. Qualitative identification, Inhouse rpt. for Air Force Wright Aeronautical Labs., Air Force Wright Aeronautical Labs., Wright-Patterson AFB, Ohio, 1981, 75. [all data]
Cardeal, da Silva, et al., 2006
Cardeal, Z.L.; da Silva, M.D.R.G.; Marriott, P.J.,
Comprehensive two-dimensional gas chromatography/mass spectrometric analysis of pepper volatiles,
Rapid Commun. Mass Spectrom., 2006, 20, 19, 2823-2836, https://doi.org/10.1002/rcm.2665
. [all data]
Hassoun, Pilling, et al., 1999
Hassoun, S.; Pilling, M.J.; Bartle, K.D.,
A catalogue of urban hydrocarbons for the city of Leeds: atmospheric monitoring of volatile organic compounds by thermal desorption-gas chromatography,
J. Environ. Monitor., 1999, 1, 5, 453-458, https://doi.org/10.1039/a904879k
. [all data]
Mahadevan and Farmer, 2006
Mahadevan, K.; Farmer, L.,
Key Odor Impact Compounds in Three Yeast Extract Pastes,
J. Agric. Food Chem., 2006, 54, 19, 7242-7250, https://doi.org/10.1021/jf061102x
. [all data]
Le Guen, Prost, et al., 2000
Le Guen, S.; Prost, C.; Demaimay, M.,
Characterization of odorant compounds of mussels (Mytilus edulis) according to their origin using gas chromatography-olfactometry and gas chromatography-mass spectrometry,
J. Chromatogr. A, 2000, 896, 1-2, 361-371, https://doi.org/10.1016/S0021-9673(00)00729-9
. [all data]
Tian, 1993
Tian, S.,
Analysis of the tower bottom oil of dimethylbenzene rectifying tower and C9 aromatic hydrocarbon fraction by capillary gas chromatography,
Chin. J. Chromatogr., 1993, 11, 4, 202-206. [all data]
Sojak and Vigdergauz, 1978
Sojak, L.; Vigdergauz, M.S.,
Comparison of interpolation methods for the interpretation of retention data in gas chromatography,
J. Chromatogr., 1978, 148, 1, 159-167, https://doi.org/10.1016/S0021-9673(00)99332-4
. [all data]
Papazova and Pankova, 1975
Papazova, D.I.; Pankova, M.C.,
Identification of individual aromatic hydrocarbons in kerosene fraction (b.p. 150-250 °),
J. Chromatogr., 1975, 105, 2, 411-414, https://doi.org/10.1016/S0021-9673(01)82276-7
. [all data]
Bramston-Cook, 2013
Bramston-Cook, R.,
Kovats indices for C2-C13 hydrocarbons and selected oxygenated/halocarbons with 100 % dimethylpolysiloxane columns, 2013, retrieved from http://lotusinstruments.com/monographs/List .... [all data]
Kotowska, Zalikowski, et al., 2012
Kotowska, U.; Zalikowski, M.; Isidorov, V.A.,
HS-SPME/GC-MS analysis of volatile and semi-volatile organic compounds emitted from municipal sewage sludge,
Environ. Monit. Asses., 2012, 184, 5, 2893-2907, https://doi.org/10.1007/s10661-011-2158-8
. [all data]
Supelco, 2012
Supelco, CatalogNo. 24160-U,
Petrocol DH Columns. Catalog No. 24160-U, 2012, retrieved from http://www.sigmaaldrich.com/etc/medialib/docs/Supelco/Datasheet/1/w97949.Par.0001.File.tmp/w97949.pdf. [all data]
Zhang, Ding, et al., 2009
Zhang, X.; Ding, L.; Sun, Z.; Song, L.; Sun, T.,
Study on quantitative structure-retention relationships for hydrocarbons in FCC gasoline,
Chromatographia, 2009, 70, 3/4, 511-518, https://doi.org/10.1365/s10337-009-1174-0
. [all data]
Orav, Kailas, et al., 1999
Orav, A.; Kailas, T.; Muurisepp, M.; Kann, J.,
Composition of the oil from waste tires. 2. Fraction boiling at 160-180 0C,
Proc. Estonian Acad. Sci. Chem., 1999, 48, 3, 136-140. [all data]
Wang and Fingas, 1995
Wang, Z.; Fingas, M.,
Differentiation of the source of spilled oil and monitoring of the oil weathering process using gas chromatography-mass spectrometry,
J. Chromatogr. A, 1995, 712, 2, 321-343, https://doi.org/10.1016/0021-9673(95)00546-Y
. [all data]
Ciccioli, Cecinato, et al., 1992
Ciccioli, P.; Cecinato, A.; Brancaleoni, E.; Frattoni, M.; Liberti, A.,
Use of carbon adsorption traps combined with high resolution gas chromatography - mass spectrometry for the analysis of polar and non-polar C4-C14 hydrocarbons involved in photochemical smog formation,
J. Hi. Res. Chromatogr., 1992, 15, 2, 75-84, https://doi.org/10.1002/jhrc.1240150205
. [all data]
Hartgers, Damste, et al., 1992
Hartgers, W.A.; Damste, J.S.S.; de Leeuw, J.W.,
Identification of C2-C4 alkylated benzenes in flash pyrolysates of kerogens, coals and asphaltenes,
J. Chromatogr., 1992, 606, 2, 211-220, https://doi.org/10.1016/0021-9673(92)87027-6
. [all data]
Robinson, Adams, et al., 2012
Robinson, A.L.; Adams, D.O.; Boss, P.K.; Heymann, H.; Solomon, P.S.; Trengove, R.D.,
Influence of geographic origine on the sensory characteristics and wine composition of Vitus viniferas cv. Cabernet Sauvignon wines from Australia (Supplemental data),
Am. J. Enol. Vitic., 2012, 64, 4, 467-476, https://doi.org/10.5344/ajev.2012.12023
. [all data]
Vichi, Pizzale, et al., 2005
Vichi, S.; Pizzale, L.; Conte, L.S.; Buxaderas, S.; L´opez-Tamames, E.,
Simultaneous determination of volatile and semi-volatile aromatic hydrocarbons in virgin olive oil by headspace solid-phase microextraction coupled to gas chromatography/mass spectrometry,
J. Chromatogr. A, 2005, 1090, 1-2, 146-154, https://doi.org/10.1016/j.chroma.2005.07.007
. [all data]
Cornwell and Cordano, 2003
Cornwell, E.; Cordano, G.,
Nueva proposicion para predecir datos de retencion obtenidos mediante cromatografia de gases de hidrocarburos derivados de las naftas,
Revista de la Sociedad Quimica de Mexico, 2003, 47, 1, 38-43. [all data]
Spieksma, 1999
Spieksma, W.,
Determination of vapor liquid equilibrium from the Kovats retention index on dimethylsilicone using the Wilson mixing tool,
J. Hi. Res. Chromatogr., 1999, 22, 10, 565-588, https://doi.org/10.1002/(SICI)1521-4168(19991001)22:10<565::AID-JHRC565>3.0.CO;2-2
. [all data]
Xiuhua, Zhang, et al., 1996
Xiuhua, Zh.; Zhang, L.; Che, X.,
Prediction of the Kovats retention indexes of polysubstituted alkylbenzenes,
Chin. J. Chromatogr., 1996, 14, 4, 244-248. [all data]
Matisová, Juranyiová, et al., 1991
Matisová, E.; Juranyiová, E.; Kurán, P.; Brandsteterová, E.; Kocan, A.; Holotík, S.,
Analysis of multicomponent mixtures by high-resolution capillary gas chromatography and combined gas chromatography-mass spectrometry. I. Aromatics in a hydrocarbon matrix,
J. Chromatogr., 1991, 552, 301-312, https://doi.org/10.1016/S0021-9673(01)95946-1
. [all data]
Waggott and Davies, 1984
Waggott, A.; Davies, I.W.,
Identification of organic pollutants using linear temperature programmed retention indices (LTPRIs) - Part II, 1984, retrieved from http://dwi.defra.gov.uk/research/completed-research/reports/dwi0383.pdf. [all data]
Sutter, Peterson, et al., 1997
Sutter, J.M.; Peterson, T.A.; Jurs, P.C.,
Prediction of gas chromatographic retention indices of alkylbenzenes,
Anal. Chim. Acta., 1997, 342, 2-3, 113-122, https://doi.org/10.1016/S0003-2670(96)00578-8
. [all data]
Rodrigues, Caldera, et al., 2008
Rodrigues, F.; Caldera, M.; Camara, J.S.,
development of a dynamic headspace solid-phase microextraction procedure coupled to GC-qMSD for evaluation the chemical profile in alcoholic beverages,
Anal. Chim. Acta, 2008, 609, 1, 82-104, https://doi.org/10.1016/j.aca.2007.12.041
. [all data]
Ivanciuc, Ivanciuc, et al., 2001
Ivanciuc, O.; Ivanciuc, T.; Klein, D.J.; Seitz, W.A.; Balaban, A.T.,
Quantitative structure-retention relationships for gas chromatographic retention indices of alkylbenzenes with molecular graph descriptors,
SAR QSAR Environ. Res., 2001, 11, 5-6, 419-452, https://doi.org/10.1080/10629360108035362
. [all data]