trans-3-methoxycinnamic acid
- Formula: C10H10O3
- Molecular weight: 178.1846
- IUPAC Standard InChIKey: LZPNXAULYJPXEH-AATRIKPKSA-N
- CAS Registry Number: 17570-26-2
- Chemical structure:
View 3d structure (requires JavaScript / HTML 5) - Species with the same structure:

Phase change data

Data compiled by: William E. Acree, Jr., James S. Chickos
Quantity | Value | Units | Method | Reference | Comment |
---|---|---|---|---|---|
ΔsubH° | 124.0 ± 0.9 | kJ/mol | ME | Monte and Hillesheim, 1999 | Based on data from 353. to 367. K. |

References

Monte and Hillesheim, 1999
Monte, Manuel J.S.; Hillesheim, Dorothea M.,
Vapour pressures, enthalpies and entropies of sublimation of trans -cinnamic acid and of nine methoxy and dimethoxycinnamic acids,
The Journal of Chemical Thermodynamics, 1999, 31, 11, 1443-1456, https://doi.org/10.1006/jcht.1999.0540
. [all data]