Anthracene, tetradecahydro-, (4aα,8aα,9aβ,10aα)-
- Formula: C14H24
- Molecular weight: 192.3404
- IUPAC Standard InChIKey: GVJFFQYXVOJXFI-SYQHCUMBSA-N
- CAS Registry Number: 1755-19-7
- Chemical structure:
View 3d structure (requires JavaScript / HTML 5) - Species with the same structure:
- Stereoisomers:
- Anthracene, tetradecahydro-, (4aα,8aα,9aα,10aα)-
- trans-anti-trans-Tetra-decahydroanthracene
- Perhydroanthracene, (4aα, 8aβ, 9aα, 10aβ)-
- Anthracene, tetradecahydro-
- Tricyclo[8.4.0.0(3,8)]dodecane, isomer # 1
- Tricyclo[8.4.0.0(3,8)]dodecane, isomer # 2
- Tricyclo[8.4.0.0(3,8)]dodecane, isomer # 3
- Tricyclo[8.4.0.0(3,8)]dodecane, isomer # 4
- Tricyclo[8.4.0.0(3,8)]dodecane, isomer # 5
- Other names: Anthracene, 1,2,3,4,4aα,5,6,7,8,8aβ,9,9aβ,10,10aα-tetradecahydro-; trans-syn-trans-Perhydroanthracene; Anthracene, tetradecahydro-, (4aα,8aβ,9aβ,10aα)-; trans-cisoid-trans-Perhydroanthracene

Gas phase thermochemistry data

Data compiled by: Glushko Thermocenter, Russian Academy of Sciences, Moscow
Constant pressure heat capacity of gas
Cp,gas (J/mol*K) | Temperature (K) | Reference | Comment |
---|---|---|---|
47.81 | 50. | Dorofeeva O.V., 1988 | Recommended values were calculated statistically mechanically using force field approximation for polycyclic aromatic hydrocarbons to estimate the needed vibrational frequencies (see also [ Dorofeeva O.V., 1986]). These functions are reproduced in the reference book [ Frenkel M., 1994]. |
79.55 | 100. | ||
114.37 | 150. | ||
150.10 | 200. | ||
209.99 | 273.15 | ||
232.4 ± 3.5 | 298.15 | ||
234.12 | 300. | ||
325.88 | 400. | ||
409.67 | 500. | ||
480.75 | 600. | ||
540.19 | 700. | ||
590.10 | 800. | ||
632.27 | 900. | ||
668.07 | 1000. | ||
698.58 | 1100. | ||
724.66 | 1200. | ||
747.02 | 1300. | ||
766.27 | 1400. | ||
782.89 | 1500. |

Condensed phase thermochemistry data

Data compiled by: Hussein Y. Afeefy, Joel F. Liebman, and Stephen E. Stein
Quantity | Value | Units | Method | Reference | Comment |
---|---|---|---|---|---|
ΔfH°solid | -330.6 ± 3.4 | kJ/mol | Ccb | Frisch, 1962 | see Margrave, Frisch, et al., 1963 |
Quantity | Value | Units | Method | Reference | Comment |
ΔcH°solid | -8608.5 ± 2.9 | kJ/mol | Ccb | Frisch, 1962 | see Margrave, Frisch, et al., 1963; Corresponding ΔfHºsolid = -330.6 kJ/mol (simple calculation by NIST; no Washburn corrections) |

Phase change data

Data compiled as indicated in comments:
ALS - Hussein Y. Afeefy, Joel F. Liebman, and Stephen E. Stein
AC - William E. Acree, Jr., James S. Chickos
Quantity | Value | Units | Method | Reference | Comment |
---|---|---|---|---|---|
ΔsubH° | 87.4 ± 2.4 | kJ/mol | V | Frisch, 1962 | see Margrave, Frisch, et al., 1963; ALS |
Enthalpy of sublimation
ΔsubH (kJ/mol) | Temperature (K) | Method | Reference | Comment |
---|---|---|---|---|
88.1 | 308. | A | Stephenson and Malanowski, 1987 | Based on data from 293. to 335. K.; AC |
87.4 ± 2.4 | 365. | ME | Margrave, Frisch, et al., 1963 | Based on data from 335. to 393. K. See also Cox and Pilcher, 1970.; AC |

Gas phase ion energetics data

Data compiled as indicated in comments:
LBLHLM - Sharon G. Lias, John E. Bartmess, Joel F. Liebman, John L. Holmes, Rhoda D. Levin, and W. Gary Mallard
Ionization energy determinations
IE (eV) | Method | Reference | Comment |
---|---|---|---|
8.8 | PE | Heilbronner, Honegger, et al., 1984 | LBLHLM |

Reaction thermochemistry data

Data compiled by: Hussein Y. Afeefy, Joel F. Liebman, and Stephen E. Stein
Individual Reactions
By formula: C14H24 = C14H24
Quantity | Value | Units | Method | Reference | Comment |
---|---|---|---|---|---|
ΔrH° | -2.79 ± 0.28 | kcal/mol | Eqk | Allinger and Wuesthoff, 1971 | gas phase |
ΔrH° | -8.74 ± 0.61 | kcal/mol | Eqk | Allinger and Wuesthoff, 1971 | gas phase |
By formula: C14H24 = C14H24
Quantity | Value | Units | Method | Reference | Comment |
---|---|---|---|---|---|
ΔrH° | -4.15 ± 0.81 | kcal/mol | Eqk | Allinger and Wuesthoff, 1971 | gas phase |
By formula: C14H24 = C14H24
Quantity | Value | Units | Method | Reference | Comment |
---|---|---|---|---|---|
ΔrH° | -5.58 ± 0.28 | kcal/mol | Eqk | Allinger and Wuesthoff, 1971 | gas phase |

References

Dorofeeva O.V., 1988
Dorofeeva O.V.,
Thermodynamic Properties of Polycyclic Aromatic Hydrocarbons in the Gaseous Phase. Institute for High Temperatures, USSR Academy of Sciences, Preprint No.1-238 (in Russian), Moscow, 1988. [all data]
Dorofeeva O.V., 1986
Dorofeeva O.V.,
On calculation of thermodynamic properties of polycyclic aromatic hydrocarbons,
Thermochim. Acta, 1986, 102, 59-66. [all data]
Frenkel M., 1994
Frenkel M.,
Thermodynamics of Organic Compounds in the Gas State, Vol. I, II, Thermodynamics Research Center, College Station, Texas, 1994, 1994. [all data]
Frisch, 1962
Frisch, M.A.,
A high precision calorimeter for ther measurement of small energy differences, Ph.D. Thesis for University of Wisconsin, 1962, 1-100. [all data]
Margrave, Frisch, et al., 1963
Margrave, J.L.; Frisch, M.A.; Bautista, R.G.; Clarke, R.L.; Johnson, W.S.,
Further studies on the energy difference between the chair and twist forms of cyclohexane,
J. Am. Chem. Soc., 1963, 85, 546-548. [all data]
Stephenson and Malanowski, 1987
Stephenson, Richard M.; Malanowski, Stanislaw,
Handbook of the Thermodynamics of Organic Compounds, 1987, https://doi.org/10.1007/978-94-009-3173-2
. [all data]
Cox and Pilcher, 1970
Cox, J.D.; Pilcher, G.,
Thermochemistry of Organic and Organometallic Compounds, Academic Press Inc., London, 1970, 643. [all data]