Bicyclo[2.2.2]oct-5-ene-2,3-dione
- Formula: C8H8O2
- Molecular weight: 136.1479
- IUPAC Standard InChIKey: BGFONWVHWNCROZ-UHFFFAOYSA-N
- CAS Registry Number: 17547-68-1
- Chemical structure:
View 3d structure (requires JavaScript / HTML 5) - Permanent link for this species. Use this link for bookmarking this species for future reference.

Reaction thermochemistry data

Data compiled by: Hussein Y. Afeefy, Joel F. Liebman, and Stephen E. Stein
Individual Reactions
By formula: C6H8 + O2 = C8H8O2
Quantity | Value | Units | Method | Reference | Comment |
---|---|---|---|---|---|
ΔrH° | -175. ± 20. | kJ/mol | Cpha | Olmsted, 1980 | liquid phase; solvent: CCl4 |

References

Olmsted, 1980
Olmsted, J., III,
Photocalorimetric studies of singlet oxygen reactions,
J. Am. Chem. Soc., 1980, 102, 66-71. [all data]