2-Propenoic acid, 3-phenyl-, methyl ester, (E)-
- Formula: C10H10O2
- Molecular weight: 162.1852
- IUPAC Standard InChIKey: CCRCUPLGCSFEDV-BQYQJAHWSA-N
- CAS Registry Number: 1754-62-7
- Chemical structure:
View 3d structure (requires JavaScript / HTML 5) - Stereoisomers:
- Other names: Cinnamic acid, methyl ester, (E)-; (E)-Methyl cinnamate; trans-Methyl cinnamate; trans-Methyl 3-phenyl-2-propenoate; Methyl (E)-cinnamate; Methyl trans-cinnamate; trans-Cinnamic acid methyl ester; Methyl (E)-3-phenylprop-2-enoate; Methyl (E)-3-phenylpropenoate; Methyl cinnamate, (E); (E)-3-Phenylacrylic acid methyl ester; Methyl (E)-3-phenyl-2-propenoate; Methyl trans-3-phenyl-2-propenoate; Methyl (2E)-3-phenyl-2-propenoate; 925685-28-5

Reaction thermochemistry data

Data compiled by: Hussein Y. Afeefy, Joel F. Liebman, and Stephen E. Stein
Individual Reactions
By formula: H2 + C10H10O2 = C10H12O2
Quantity | Value | Units | Method | Reference | Comment |
---|---|---|---|---|---|
ΔrH° | -101.8 | kcal/mol | Chyd | Veselova and Sul'man, 1980 | liquid phase |

Kovats' RI, non-polar column, temperature ramp

View large format table.

Column type Active phase I Reference Comment
CapillaryDB-51379.Viña and Murillo, 200330. m/0.25 mm/0.25 μm, He, 50. C @ 5. min, 0.5 K/min, 250. C @ 10. min
CapillaryBP-11364.Jain, Srivastava, et al., 200125. m/0.55 mm/0.25 μm, N2, 5. K/min, 220. C @ 15. min; Tstart: 60. C
CapillaryMethyl Silicone1343.Adegoke, Rao, et al., 199830. m/0.32 mm/0.25 μm, He, 60. C @ 2. min, 2. K/min, 250. C @ 5. min

Kovats' RI, polar column, temperature ramp

View large format table.

Column type Active phase I Reference Comment
CapillaryInnowax2050.Viña and Murillo, 200330. m/0.25 mm/0.25 μm, He, 50. C @ 5. min, 0.5 K/min, 250. C @ 10. min
CapillarySupelcowax-102105.Wong and Teng, 1994He, 35. C @ 5. min, 3. K/min, 200. C @ 20. min; Column length: 60. m; Column diameter: 0.25 mm

Van Den Dool and Kratz RI, non-polar column, temperature ramp

View large format table.

Column type Active phase I Reference Comment
CapillaryHP-1011364.Politeo, Jukic, et al., 200725. m/0.2 mm/0.2 μm, He, 70. C @ 2. min, 3. K/min, 200. C @ 15. min
CapillaryDB-51380.bin Jantan, Yalvema, et al., 200525. m/0.25 mm/0.25 μm, N2, 75. C @ 10. min, 3. K/min, 210. C @ 1. min
CapillaryHP-5MS1379.Pino, Mesa, et al., 200530. m/0.25 mm/0.25 μm, He, 60. C @ 2. min, 4. K/min, 250. C @ 20. min
CapillarySPB-51379.Píno, Marbot, et al., 200430. m/0.25 mm/0.25 μm, He, 60. C @ 2. min, 4. K/min, 250. C @ 20. min
CapillarySPB-51379.Pino, Marbot, et al., 200430. m/0.25 mm/0.25 μm, He, 60. C @ 2. min, 4. K/min, 250. C @ 20. min
CapillaryBPX-51377.bin Ahmad and bin Jantan, 200330. m/0.25 mm/0.25 μm, N2, 75. C @ 10. min, 3. K/min, 210. C @ 1. min
CapillarySE-301350.bin Jantan, Ayop, et al., 200225. m/0.25 mm/0.25 μm, N2, 60. C @ 10. min, 3. K/min, 180. C @ 10. min
CapillaryDB-51381.Isidorov, Zenkevich, et al., 2001He, 3. K/min; Column length: 30. m; Column diameter: 0.25 mm; Tstart: 50. C; Tend: 250. C
CapillaryHP-51381.Lazari, Skaltsa, et al., 200030. m/0.25 mm/0.25 μm, He, 50. C @ 5. min, 4. K/min; Tend: 280. C

Van Den Dool and Kratz RI, non-polar column, custom temperature program

View large format table.

Column type Active phase I Reference Comment
CapillaryHP-5MS1392.4Andriamaharavo, 201430. m/0.25 mm/0.25 μm, He; Program: 60C (1 min) => 5 C/min => 210C => 10 C/min => 280C (15 min)

Van Den Dool and Kratz RI, polar column, temperature ramp

View large format table.

Column type Active phase I Reference Comment
CapillaryHP-20M2019.Politeo, Jukic, et al., 200750. m/0.2 mm/0.2 μm, He, 70. C @ 4. min, 4. K/min, 180. C @ 15. min
CapillaryLM-1202057.Pinto, Guedes, et al., 200650. m/0.25 mm/0.5 μm, 3. K/min, 240. C @ 30. min; Tstart: 50. C
CapillaryDB-Wax2080.Brophy, Goldsack, et al., 200060. m/0.53 mm/1.0 μm, He, 3. K/min; Tstart: 50. C; Tend: 220. C
CapillaryDB-Wax2080.Brophy, Goldsack, et al., 1999He, 3. K/min; Column length: 60. m; Column diameter: 0.53 mm; Tstart: 50. C; Tend: 220. C

Normal alkane RI, non-polar column, temperature ramp

View large format table.

Column type Active phase I Reference Comment
CapillaryHP-5 MS1352.Sardashti, Valizadeh, et al., 201360. m/0.25 mm/0.25 μm, Helium, 40. C @ 1. min, 3. K/min, 250. C @ 20. min
CapillaryCol-Elite 5MS1398.Gudaityte and Venskutonis R.P., 200730. m/0.25 mm/0.25 μm, He, 3. K/min; Tstart: 30. C; Tend: 246. C
CapillaryDB-51375.Tiwary, Nail, et al., 2007Helium, 2. K/min, 200. C @ 20. min; Column length: 30. m; Column diameter: 0.25 mm; Tstart: 60. C
CapillaryDB-51379.Tiwary, Nail, et al., 2007Helium, 2. K/min, 200. C @ 20. min; Column length: 30. m; Column diameter: 0.25 mm; Tstart: 60. C
CapillaryHP-11345.Castel, Fernandez, et al., 200650. m/0.2 mm/0.33 μm, He, 60. C @ 4. min, 2. K/min, 250. C @ 30. min
CapillaryBPX-51365.Fons, Rapior, et al., 200625. m/0.20 mm/0.13 μm, Helium, 50. C @ 2. min, 3. K/min; Tend: 230. C
CapillarySPB-11365.Wong, Lee, et al., 200550. m/0.2 mm/0.33 μm, He, 50. C @ 3. min, 4. K/min, 220. C @ 30. min
CapillaryHP-51353.N/A30. m/0.32 mm/0.25 μm, Helium, 40. C @ 2. min, 5. K/min, 250. C @ 5. min
CapillaryDB-51353.Wu, Krings, et al., 200530. m/0.32 mm/0.25 μm, He, 40. C @ 2. min, 5. K/min, 250. C @ 10. min
CapillaryDB-51353.Wu, Krings, et al., 200530. m/0.32 mm/0.25 μm, He, 40. C @ 2. min, 5. K/min, 250. C @ 10. min
CapillaryDB-11380.bin Jantan, Ayop, et al., 200425. m/0.25 mm/0.25 μm, 60. C @ 10. min, 3. K/min, 180. C @ 10. min
CapillaryDB-5MS1379.paz Lima, Silva, et al., 200430. m/0.25 mm/0.25 μm, He, 3. K/min; Tstart: 60. C; Tend: 240. C
CapillaryRSL-2001365.Jirovetz, Buchbauer, et al., 200330. m/0.32 mm/0.25 μm, H2, 40. C @ 5. min, 6. K/min, 280. C @ 5. min
CapillaryRSL-2001352.Jirovetz, Buchbauer, et al., 2003, 230. m/0.32 mm/0.25 μm, H2, 40. C @ 5. min, 6. K/min, 280. C @ 5. min
CapillarySPB-51379.Pino, Marbot, et al., 200230. m/0.25 mm/0.25 μm, Helium, 60. C @ 2. min, 4. K/min, 250. C @ 20. min
CapillaryHP-51378.Bicalho, Pereira, et al., 200030. m/0.25 mm/0.25 μm, H2, 40. C @ 10. min, 3. K/min, 280. C @ 10. min
CapillaryBP-11354.Mallavarapu, Kulkarni, et al., 199925. m/0.50 mm/0.25 μm, N2, 5. K/min, 220. C @ 10. min; Tstart: 60. C
CapillaryDB-5MS1379.Zoghbi, Andrade, et al., 199930. m/0.25 mm/0.25 μm, He, 3. K/min; Tstart: 60. C; Tend: 240. C

Normal alkane RI, non-polar column, custom temperature program

View large format table.

Column type Active phase I Reference Comment
CapillaryDB-5 MS1354.Purushothaman and Ravi, 201330. m/0.25 mm/0.25 μm, Helium; Program: 70 0C 5 0C/min -> 120 0C 10 0C/min -> 280 0C (20 min)
CapillarySLB-5 MS1384.Costa, De Fina, et al., 200830. m/0.25 mm/0.25 μm, Helium; Program: 50 0C 3 0C/min -> 250 0C (1 min) 10 0C/min -> 300 0C (5 min)
CapillarySLB-5 MS1376.Costa, De Fina, et al., 200830. m/0.25 mm/0.25 μm, Helium; Program: not specified
CapillaryCP Sil 8 CB1386.Meekijjaroenroj, Bessière, et al., 200730. m/0.25 mm/0.25 μm, He; Program: 50C(3min) => 3C/min => 100C => 2.7C/min => 140C => 2.4C/min => 180C => 6C/min => 250C
CapillaryPolydimethyl siloxane with 5 % Ph groups1379.Pino, Marbot, et al., 2005Program: not specified
CapillaryDB-11379.Cavalcanti, de Morais, et al., 2004He; Column length: 30. m; Column diameter: 0.25 mm; Program: 35C => 4C/min => 180C => 10C/min => 250C
CapillaryDB-11380.Silva, Santos, et al., 200330. m/0.25 mm/0.1 μm, He; Program: 35C => 4C/min => 180C => 10C/min => 250C
CapillaryDB-51379.Isidorov, Zenkevich, et al., 2001He; Column length: 30. m; Column diameter: 0.25 mm; Program: not specified

Normal alkane RI, polar column, temperature ramp

View large format table.

Column type Active phase I Reference Comment
CapillarySupelcowax-102095.Wong, Lee, et al., 200530. m/0.25 mm/0.25 μm, He, 50. C @ 3. min, 4. K/min, 220. C @ 30. min
CapillaryZB-Wax2024.N/A30. m/0.32 mm/0.25 μm, Helium, 40. C @ 2. min, 5. K/min, 250. C @ 5. min
CapillaryZB-Wax2047.N/A30. m/0.32 mm/0.25 μm, Helium, 40. C @ 2. min, 5. K/min, 250. C @ 5. min
CapillaryZB-Wax2046.Wu, Krings, et al., 200530. m/0.32 mm/0.25 μm, He, 40. C @ 2. min, 5. K/min, 250. C @ 10. min
CapillaryDB-Wax2047.Wu, Krings, et al., 200530. m/0.32 mm/0.25 μm, H2, 40. C @ 2. min, 5. K/min, 230. C @ 15. min
CapillaryZB-Wax2046.Wu, Krings, et al., 200530. m/0.32 mm/0.25 μm, He, 40. C @ 2. min, 5. K/min, 250. C @ 10. min
CapillaryInnowax2096.Suleimenov, Atazharova, et al., 2003He, 60. C @ 10. min, 4. K/min, 220. C @ 10. min; Column length: 60. m; Column diameter: 0.25 mm
CapillaryDB-Wax2074.Christoph, 200160. m/0.25 mm/0.25 μm, He, 3. K/min; Tstart: 45. C; Tend: 240. C
CapillaryDB-Wax2077.Werkhoff, Güntert, et al., 199860. m/0.32 mm/0.25 μm, H2, 3. K/min; Tstart: 60. C; Tend: 220. C

Normal alkane RI, polar column, custom temperature program

View large format table.

Column type Active phase I Reference Comment
CapillaryHP-Innowax FSC2096.Sezik E., Kocakulak E., et al., 200560. m/0.25 mm/0.25 μm, He; Program: 60C(10min) => 4C/min => 220C(10min) => 1C/min => 240C
CapillaryHP-Innowax FSC2096.Erdemoglu, Sener, et al., 200360. m/0.25 mm/0.25 μm, He; Program: 60C(10min) => 4C/min => 220C(10min) => 1C/min => 240C

References

Veselova and Sul'man, 1980
Veselova, M.E.; Sul'man, E.M.,
Effect of the chemical structure of α,β-unsaturated esters and ketones on the selectivity of their hydrogenation,
Svoistva Veshchestv i Stroenie Molekul, Kalinin, 1980, 140-143. [all data]