1,2-Benzenedithiol
- Formula: C6H6S2
- Molecular weight: 142.242
- IUPAC Standard InChIKey: JRNVQLOKVMWBFR-UHFFFAOYSA-N
- CAS Registry Number: 17534-15-5
- Chemical structure:
View 3d structure (requires JavaScript / HTML 5) - Other names: Benzene-1,2-dithiol

Phase change data

Data compiled by: Robert L. Brown and Stephen E. Stein
Quantity | Value | Units | Method | Reference | Comment |
---|---|---|---|---|---|
Tboil | 511.7 | K | N/A | Weast and Grasselli, 1989 | |
Tboil | 511. to 512. | K | N/A | Buckingham and Donaghy, 1982 | |
Quantity | Value | Units | Method | Reference | Comment |
Tfus | 300. to 301. | K | N/A | Buckingham and Donaghy, 1982 |
Reduced pressure boiling point
Tboil (K) | Pressure (bar) | Reference |
---|---|---|
393.2 | 0.023 | Weast and Grasselli, 1989 |
333. to 334. | 0.0001 | Buckingham and Donaghy, 1982 |

References

Weast and Grasselli, 1989
CRC Handbook of Data on Organic Compounds, 2nd Editon, Weast,R.C and Grasselli, J.G., ed(s)., CRC Press, Inc., Boca Raton, FL, 1989, 1. [all data]
Buckingham and Donaghy, 1982
Buckingham, J.; Donaghy, S.M.,
Dictionary of Organic Compounds: Fifth Edition, Chapman and Hall, New York, 1982, 1. [all data]