1,2-Bis(3-cyclohexenyl)ethylene
- Formula: C14H20
- Molecular weight: 188.3086
- IUPAC Standard InChIKey: JLAKTYIHPZLLKX-VAWYXSNFSA-N
- CAS Registry Number: 17527-28-5
- Chemical structure:
View 3d structure (requires JavaScript / HTML 5) - Other names: 1,3-Bis(3-cyclohexen-1-yl)ethylene,c&t; 1,2-Bis(3-cyclohexenyl)ethylene,c&t; Cyclohexene, 4,4'-(1,2-ethenediyl)bis-; 4,4'-(vinylene-1,2-diyl)biscyclohexene

Phase change data

Data compiled by: Robert L. Brown and Stephen E. Stein
Reduced pressure boiling point
Tboil (K) | Pressure (bar) | Reference |
---|---|---|
389. to 391. | 0.0047 | Frinton Laboratories Inc., 1986 |

References

Frinton Laboratories Inc., 1986
Frinton Laboratories Inc.,
Catalog Number 11, Frinton Laboratories Inc., Vineland, NJ, 1986, 99. [all data]