1-Isopropenyl-1,2-dicarbadodecaborane

Phase change data

Data compiled by: William E. Acree, Jr., James S. Chickos

Enthalpy of vaporization

ΔvapH (kJ/mol) Temperature (K) Reference Comment
36.7398.Fein, Bobinski, et al., 1963Based on data from 323. - 473. K.

References

Fein, Bobinski, et al., 1963
Fein, Marvin M.; Bobinski, Jack; Mayes, Nathan; Schwartz, Nelson; Cohen, Murray S., Carboranes. I. The Preparation and Chemistry of 1-Isopropenylcarborane and its Derivatives (a New Family of Stable Clovoboranes), Inorg. Chem., 1963, 2, 6, 1111-1115, https://doi.org/10.1021/ic50010a007 . [all data]