Molybdenyl acetylacetonate
- Formula: C10H14MoO6
- Molecular weight: 326.17
- IUPAC Standard InChIKey: SKMUJBBRXZPAJY-UZUXQKAQSA-L
- CAS Registry Number: 17524-05-9
- Chemical structure:

Gas phase thermochemistry data

Data compiled by: José A. Martinho Simões
Quantity | Value | Units | Method | Reference | Comment |
---|---|---|---|---|---|
ΔfH°gas | -1210. ± 10. | kJ/mol | Review | Martinho Simões |

Condensed phase thermochemistry data

Data compiled by: José A. Martinho Simões
Quantity | Value | Units | Method | Reference | Comment |
---|---|---|---|---|---|
ΔfH°solid | -1342.1 ± 2.9 | kJ/mol | Review | Martinho Simões |

References

Martinho Simões
Martinho Simões, J.A.,
Private communication (see http://webbook.nist.gov/chemistry/om/). [all data]