1,5-diphenyl-3-pentanol
- Formula: C17H20O
- Molecular weight: 240.3401
- IUPAC Standard InChIKey: YDNNOTNUWKPRNH-UHFFFAOYSA-N
- CAS Registry Number: 17486-86-1
- Chemical structure:
View 3d structure (requires JavaScript / HTML 5) - Permanent link for this species. Use this link for bookmarking this species for future reference.

Phase change data

Data compiled by: Thermodynamics Research Center, NIST Boulder Laboratories, Chris Muzny director
Quantity | Value | Units | Method | Reference | Comment |
---|---|---|---|---|---|
Tfus | 322.1 | K | N/A | Serijan and Wise, 1951 | Uncertainty assigned by TRC = 2. K |

References

Serijan and Wise, 1951
Serijan, K.T.; Wise, P.H.,
Dicyclic hydrocarboms. IV. Synthesis and Physical properties of alpha,alpha - and alpha,omega-diphenyl- and dicyclohexyl- pentanes and hexanes,
J. Am. Chem. Soc., 1951, 73, 5191. [all data]