tetrakis(1,1,1-trifluoro-2,4-pentanedionato)hafnium(IV)

Phase change data

Data compiled by: William E. Acree, Jr., James S. Chickos

Enthalpy of vaporization

ΔvapH (kJ/mol) Temperature (K) Method Reference Comment
84.7 ± 3.1413.GSMorozova, Zherikova, et al., 2008Based on data from 403. - 423. K.
83.2 ± 2.0413.N/AZherikova, Morozova, et al., 2008Based on data from 403. - 423. K.

Enthalpy of sublimation

ΔsubH (kJ/mol) Temperature (K) Method Reference Comment
133.0 ± 1.8376.GSMorozova, Zherikova, et al., 2008Based on data from 358. - 393. K.
126.5 ± 1.8358. - 398.N/AZherikova, Morozova, et al., 2008
129.7 ± 3.8383. - 438.GSMatsubara and Kuwamoto, 1985
124.7 ± 3.8383. - 438.GSMatsubara and Kuwamoto, 1985

Enthalpy of fusion

ΔfusH (kJ/mol) Temperature (K) Method Reference
40.1398.DSCZherikova, Morozova, et al., 2008

References

Morozova, Zherikova, et al., 2008
Morozova, Natalia B.; Zherikova, Ksenia V.; Baidina, Iraida A.; Sysoev, Sergei V.; Semyannikov, Pyotr P.; Yakovkina, Lyubov' V.; Smirnova, Tamara P.; Gelfond, Nikolay V.; Igumenov, Igor K.; Carta, Giovanni; Rossetto, Gilberto, Volatile hafnium(IV) compounds with beta-diketonate and cyclopentadienyl derivatives, Journal of Physics and Chemistry of Solids, 2008, 69, 2-3, 673-679, https://doi.org/10.1016/j.jpcs.2007.07.057 . [all data]

Zherikova, Morozova, et al., 2008
Zherikova, Ksenia V.; Morozova, Natalia B.; Zelenina, Ludmila N.; Sysoev, S.V.; Chusova, Tamara P.; Igumenov, I.K., Thermal properties of hafnium(IV) and zirconium(IV) β-diketonates, J Therm Anal Calorim, 2008, 92, 3, 729-734, https://doi.org/10.1007/s10973-008-9027-x . [all data]

Matsubara and Kuwamoto, 1985
Matsubara, Norio; Kuwamoto, Tooru, Vapor pressures and enthalpies of sublimation and evaporation of trifluoroacetylacetonates in helium and helium containing the ligand vapor, Inorg. Chem., 1985, 24, 17, 2697-2701, https://doi.org/10.1021/ic00211a022 . [all data]