Monolinuron
- Formula: C9H11ClN2O2
- Molecular weight: 214.649
- IUPAC Standard InChIKey: LKJPSUCKSLORMF-UHFFFAOYSA-N
- CAS Registry Number: 1746-81-2
- Chemical structure:
View 3d structure (requires JavaScript / HTML 5) - Other names: Urea, N'-(4-chlorophenyl)-N-methoxy-N-methyl-; Urea, 3-(p-chlorophenyl)-1-methoxy-1-methyl-; Aresin; Arezin; Arezine; Monorotox; Afesin; Arresin; 3-(4-Chlorphenyl)-1-methoxy-1-methylharnstoff; N-(4-Chlorophenyl)-N'-methoxy-N-methylurea; 3-(4-Chlorophenyl)-1-methoxy-1-methylurea; HOE 2747; Premalin; N'-(4-Chlorophenyl)-N-methoxy-N-methylurea; 1-Methoxy-1-methyl-3-(4-chlorophenyl)urea

Phase change data

Data compiled as indicated in comments:
TRC - Thermodynamics Research Center, NIST Boulder Laboratories, Chris Muzny director
AC - William E. Acree, Jr., James S. Chickos
Quantity | Value | Units | Method | Reference | Comment |
---|---|---|---|---|---|
Tfus | 353.91 | K | N/A | Donnelly, Drewes, et al., 1990 | Uncertainty assigned by TRC = 0.2 K; TRC |
Enthalpy of fusion
ΔfusH (kcal/mol) | Temperature (K) | Method | Reference | Comment |
---|---|---|---|---|
5.387 | 353.4 | DSC | Acree, 1991 | See also Donnelly, Drewes, et al., 1990, 2.; AC |

References

Donnelly, Drewes, et al., 1990
Donnelly, J.R.; Drewes, L.A.; Johnson, R.L.; Munslow, W.D.; Knapp, K.K.; Sovocool, G.W.,
Purity and heat of fusion data for environmental standards as determined by differential scanning calorimetry,
Thermochim. Acta, 1990, 167, 2, 155, https://doi.org/10.1016/0040-6031(90)80476-F
. [all data]
Acree, 1991
Acree, William E.,
Thermodynamic properties of organic compounds: enthalpy of fusion and melting point temperature compilation,
Thermochimica Acta, 1991, 189, 1, 37-56, https://doi.org/10.1016/0040-6031(91)87098-H
. [all data]
Donnelly, Drewes, et al., 1990, 2
Donnelly, J.R.; Drewes, L.A.; Johnson, R.L.; Munslow, W.D.; Knapp, K.K.; Sovocool, G.W.,
Purity and heat of fusion data for environmental standards as determined by differential scanning calorimetry,
Thermochimica Acta, 1990, 167, 2, 155-187, https://doi.org/10.1016/0040-6031(90)80476-F
. [all data]