As-Indacene, 1,2,3,6,7,8-hexahydro-1,1,6,6-tetramethyl-4-(1-methylethyl)-
- Formula: C19H28
- Molecular weight: 256.4256
- IUPAC Standard InChIKey: BDVXGLCBHPSEGG-UHFFFAOYSA-N
- CAS Registry Number: 17465-47-3
- Chemical structure:
View 3d structure (requires JavaScript / HTML 5) - Other names: As-Hydrindacene, 4-isopropyl-1,1,6,6-tetramethyl-

Phase change data

Data compiled by: Thermodynamics Research Center, NIST Boulder Laboratories, Chris Muzny director
Quantity | Value | Units | Method | Reference | Comment |
---|---|---|---|---|---|
Tfus | 355. | K | N/A | Anonymous, 1969 | Uncertainty assigned by TRC = 4. K |

References

Anonymous, 1969
Anonymous, R.,
Freon Fluorocarbons - properties and applications, E. I. Du Pont, Freon Product Information, B-2, 1969. [all data]