Benzene, (2-propenyloxy)-
- Formula: C9H10O
- Molecular weight: 134.1751
- IUPAC Standard InChIKey: POSICDHOUBKJKP-UHFFFAOYSA-N
- CAS Registry Number: 1746-13-0
- Chemical structure:
View 3d structure (requires JavaScript / HTML 5) - Other names: Ether, allyl phenyl; Allyl phenoxylate; Allyl phenyl ether; Allyloxybenzene; Phenyl allyl ether; Phenyl 2-propenyl ether; 3-Phenoxypropene; Phenylpropenyl ether; USAF DO-23; (2-Propenyloxy)benzene; Benzene, (2-propen-1-yloxy)-; NSC 4746

Condensed phase thermochemistry data

Data compiled by: Hussein Y. Afeefy, Joel F. Liebman, and Stephen E. Stein
Quantity | Value | Units | Method | Reference | Comment |
---|---|---|---|---|---|
ΔfH°liquid | -37.7 ± 2.5 | kJ/mol | Ccb | Aizatullova, Belyakova, et al., 1983 | |
Quantity | Value | Units | Method | Reference | Comment |
ΔcH°liquid | -4932.9 ± 2.5 | kJ/mol | Ccb | Aizatullova, Belyakova, et al., 1983 | Corresponding ΔfHºliquid = -37.8 kJ/mol (simple calculation by NIST; no Washburn corrections) |

Phase change data

Data compiled as indicated in comments:
BS - Robert L. Brown and Stephen E. Stein
TRC - Thermodynamics Research Center, NIST Boulder Laboratories, Chris Muzny director
AC - William E. Acree, Jr., James S. Chickos
Quantity | Value | Units | Method | Reference | Comment |
---|---|---|---|---|---|
Tboil | 464.9 | K | N/A | Weast and Grasselli, 1989 | BS |
Tboil | 464.9 | K | N/A | Perkin, 1896 | Uncertainty assigned by TRC = 0.5 K; TRC |
Enthalpy of vaporization
ΔvapH (kJ/mol) | Temperature (K) | Method | Reference | Comment |
---|---|---|---|---|
49.4 | 364. | A | Stephenson and Malanowski, 1987 | Based on data from 349. to 456. K.; AC |

References

Aizatullova, Belyakova, et al., 1983
Aizatullova, R.M.; Belyakova, Z.V.; Genchel', V.G.; Mosin, A.M.; Pomerantseva, M.G.; Toporkova, A.I.,
Thermochemistry of the hydrosilylation reaction,
Russ. J. Phys. Chem. (Engl. Transl.), 1983, 57, 258-259. [all data]
Weast and Grasselli, 1989
CRC Handbook of Data on Organic Compounds, 2nd Editon, Weast,R.C and Grasselli, J.G., ed(s)., CRC Press, Inc., Boca Raton, FL, 1989, 1. [all data]
Perkin, 1896
Perkin, W.H.,
LXIX. On Magnetic Rotatory Power, especially of Aromatic Compounds,
J. Chem. Soc., 1896, 69, 1025-1257. [all data]
Stephenson and Malanowski, 1987
Stephenson, Richard M.; Malanowski, Stanislaw,
Handbook of the Thermodynamics of Organic Compounds, 1987, https://doi.org/10.1007/978-94-009-3173-2
. [all data]