2,3,7,8-Tetrachlorodibenzo-p-dioxin
- Formula: C12H4Cl4O2
- Molecular weight: 321.971
- IUPAC Standard InChIKey: HGUFODBRKLSHSI-UHFFFAOYSA-N
- CAS Registry Number: 1746-01-6
- Chemical structure:
View 3d structure (requires JavaScript / HTML 5) - Other names: Dibenzo-p-dioxin, 2,3,7,8-tetrachloro-; Dioxin (herbicide contaminant); TCDBD; TCDD; 2,3,7,8-Tetrachlorodibenzo-1,4-Dioxin; Dibenzo[b,e][1,4]dioxin, 2,3,7,8-tetrachloro-; 2,3,7,8-Czterochlorodwubenzo-p-dwuoksyny; Dioksyny; Dioxine; Dioxin; NCI-C03714; 2,3,7,8-TCDD; 2,3,7,8-Tetrachlorodibenzo(b,e)(1,4)dioxan; Tetradioxin; Tetrachlorodibenzodioxin; 2,3,7,8-tetrachlorodibenzodioxin; 2,3,7,8-tetrachlorodibenzo[b,e][1,4]dioxin

Phase change data

Data compiled by: William E. Acree, Jr., James S. Chickos
Enthalpy of sublimation
ΔsubH (kJ/mol) | Temperature (K) | Reference |
---|---|---|
124. | 578. | Schroy, Hileman, et al., 1985 |
Enthalpy of fusion
ΔfusH (kJ/mol) | Temperature (K) | Reference |
---|---|---|
38.9 | 578.2 | Rordorf, 1986 |

Kovats' RI, non-polar column, isothermal

View large format table.

Column type Active phase Temperature (C) I Reference Comment
CapillaryOV-1240.2336.Shomburg G., Husmann H., et al., 1985Column length: 25. m; Column diameter: 0.25 mm

Van Den Dool and Kratz RI, non-polar column, temperature ramp

View large format table.

Column type Active phase I Reference Comment
CapillaryRTX-52348.Donnelly, Munslow, et al., 199130. m/0.25 mm/0.25 μm, He, 170. C @ 1. min, 2. K/min; Tend: 320. C
CapillaryRTX-52350.Donnelly, Munslow, et al., 199130. m/0.25 mm/0.25 μm, He, 170. C @ 1. min, 2. K/min; Tend: 320. C
CapillaryRTX-52348.Donnelly, Munslow, et al., 1991, 230. m/0.25 mm/0.25 μm, He, 170. C @ 1. min, 2. K/min; Tend: 320. C
CapillaryRTX-52350.Donnelly, Munslow, et al., 1991, 230. m/0.25 mm/0.25 μm, He, 170. C @ 1. min, 2. K/min; Tend: 320. C
CapillaryDB-52386.Donnelly, Munslow, et al., 198760. m/0.252 mm/0.25 μm, He, 170. C @ 1. min, 2. K/min; Tend: 340. C

Van Den Dool and Kratz RI, non-polar column, custom temperature program

View large format table.

Column type Active phase I Reference Comment
CapillaryHP-52353.Korhonen and Mantykoski, 198925. m/0.20 mm/0.11 μm, He; Program: 100 0C (1 min) 20 0C/min -> 180 0C 5 0C/min -> 290 0C (until elution of the last peak)
CapillaryHP-52386.Korhonen and Mantykoski, 198925. m/0.20 mm/0.11 μm, He; Program: 100 0C (1 min) 20 0C/min -> 180 0C 5 0C/min -> 290 0C (until elution of the last peak)

Normal alkane RI, non-polar column, temperature ramp

View large format table.

Column type Active phase I Reference Comment
CapillaryDB-52386.Zhao and Yu, 200760. m/0.25 mm/0.25 μm, He, 170. C @ 1. min, 2. K/min; Tend: 340. C

Normal alkane RI, non-polar column, custom temperature program

View large format table.

Column type Active phase I Reference Comment
CapillaryDB-52385.Lin, Liu, et al., 2002Program: not specified
CapillaryDB-52385.Lin, Liu, et al., 2002Program: not specified
CapillaryDB-52386.Lin, Liu, et al., 2002Program: not specified

References

Schroy, Hileman, et al., 1985
Schroy, Jerry M.; Hileman, Fred D.; Cheng, Sam C.,
Physical/chemical properties of 2,3,7,8-TCDD,
Chemosphere, 1985, 14, 6-7, 877-880, https://doi.org/10.1016/0045-6535(85)90207-3
. [all data]
Rordorf, 1986
Rordorf, B.F.,
, Proceedings of the Fifth International Symposium on Chlorinated Dioxins and Related Compounds (16-19 September), Bayreuth, Germany, 1986. [all data]