2-Allylphenol
- Formula: C9H10O
- Molecular weight: 134.1751
- IUPAC Standard InChIKey: QIRNGVVZBINFMX-UHFFFAOYSA-N
- CAS Registry Number: 1745-81-9
- Chemical structure:
View 3d structure (requires JavaScript / HTML 5) - Other names: Phenol, o-allyl-; Phenol, 2-(propenyl)-; o-Allylphenol; 2-(2-Propenyl)-phenol; Phenol, 2-(2-propenyl)-

Phase change data

Data compiled as indicated in comments:
BS - Robert L. Brown and Stephen E. Stein
TRC - Thermodynamics Research Center, NIST Boulder Laboratories, Chris Muzny director
Quantity | Value | Units | Method | Reference | Comment |
---|---|---|---|---|---|
Tboil | 493.2 | K | N/A | Weast and Grasselli, 1989 | BS |
Tboil | 493. | K | N/A | Buu-Hoi, Eckert, et al., 1954 | Uncertainty assigned by TRC = 5. K; TRC |

Kovats' RI, non-polar column, temperature ramp

Column type | Active phase | I | Reference | Comment |
---|---|---|---|---|
Capillary | SE-54 | 1170. | Adams, 2000 | 30. m/0.26 mm/0.25 μm, He, 3. K/min; Tstart: 60. C; Tend: 246. C |
Capillary | DB-5 | 1170. | Adams, 1999 | 30. m/0.26 mm/0.25 μm, He, 3. K/min; Tstart: 60. C; Tend: 246. C |

Normal alkane RI, non-polar column, custom temperature program

Column type | Active phase | I | Reference | Comment |
---|---|---|---|---|
Capillary | HP-5 | 1199. | Veres, Csupor-Loffler, et al., 2012 | 30. m/0.35 mm/0.25 μm, Nitrogen; Program: 60 0C 3 0C/min -> 210 0C 5 0C/min -> 250 0C (2 min) |
Capillary | SF-96 | 1138. | Kawasaki, Matsui, et al., 1998 | Column length: 40. m; Column diameter: 0.28 mm; Program: 75C => 3C/min => 190C(25min) => 3C/min => 210C |

Normal alkane RI, polar column, temperature ramp

Column type | Active phase | I | Reference | Comment |
---|---|---|---|---|
Capillary | DB-Wax | 2039. | Paniandy, Chane-Ming, et al., 2000 | 60. m/0.32 mm/0.25 μm, Helium, 50. C @ 2. min, 5. K/min; Tend: 230. C |

Normal alkane RI, polar column, custom temperature program

Column type | Active phase | I | Reference | Comment |
---|---|---|---|---|
Capillary | DB-Wax | 2132. | Peng, Yang, et al., 1991 | Program: not specified |

Lee's RI, non-polar column, temperature ramp

Column type | Active phase | I | Reference | Comment |
---|---|---|---|---|
Capillary | HP-5 | 192.8 | Shao, Wang, et al., 2006 | 30. m/0.3 mm/0.25 μm, He, 50. C @ 5. min, 5. K/min, 200. C @ 15. min |

References

Weast and Grasselli, 1989
CRC Handbook of Data on Organic Compounds, 2nd Editon, Weast,R.C and Grasselli, J.G., ed(s)., CRC Press, Inc., Boca Raton, FL, 1989, 1. [all data]
Buu-Hoi, Eckert, et al., 1954
Buu-Hoi, Ng.Ph.; Eckert, B.; Demerseman, P.,
Benzylations and Allylations in the Presence of Zinc Chloride,
J. Org. Chem., 1954, 19, 726-32. [all data]