2'-(Trifluoromethyl)acetophenone
- Formula: C9H7F3O
- Molecular weight: 188.1465
- IUPAC Standard InChIKey: FYDUUODXZQITBF-UHFFFAOYSA-N
- CAS Registry Number: 17408-14-9
- Chemical structure:
View 3d structure (requires JavaScript / HTML 5) - Other names: o-Trifluoromethylacetophenone; 2-Trifluoromethylacetophenone; Ethanone, 1-[2-(trifluoromethyl)phenyl]-; Acetophenone, 2'-trifluoromethyl-

Phase change data

Data compiled by: Robert L. Brown and Stephen E. Stein
Reduced pressure boiling point
Tboil (K) | Pressure (bar) | Reference |
---|---|---|
364. | 0.016 | PCR Inc., 1990 |

Gas phase ion energetics data

Data compiled by: John E. Bartmess
Electron affinity determinations
EA (eV) | Method | Reference | Comment |
---|---|---|---|
0.6418 ± 0.0087 | ECD | Wentworth, Kao, et al., 1975 |

References

PCR Inc., 1990
PCR Inc.,
Research Chemicals Catalog 1990-1991, PCR Inc., Gainesville, FL, 1990, 1. [all data]
Wentworth, Kao, et al., 1975
Wentworth, W.E.; Kao, L.W.; Becker, R.S.,
Electron affinities of substituted aromatic compounds,
J. Phys. Chem., 1975, 79, 1161. [all data]