Isophthalamide
- Formula: C8H8N2O2
- Molecular weight: 164.1613
- IUPAC Standard InChIKey: QZUPTXGVPYNUIT-UHFFFAOYSA-N
- CAS Registry Number: 1740-57-4
- Chemical structure:
View 3d structure (requires JavaScript / HTML 5) - Other names: 1,3-Benzenedicarboxamide; isophthaldiamide

Gas phase thermochemistry data

Data compiled as indicated in comments:
ALS - Hussein Y. Afeefy, Joel F. Liebman, and Stephen E. Stein
Quantity | Value | Units | Method | Reference | Comment |
---|---|---|---|---|---|
ΔfH°gas | -294. | kJ/mol | Semi | Stewart, 2004 | |
ΔfH°gas | -382. ± 0.4 | kJ/mol | Ccb | Hamilton and Witt, 1971 | ALS |

Condensed phase thermochemistry data

Data compiled by: Hussein Y. Afeefy, Joel F. Liebman, and Stephen E. Stein
Quantity | Value | Units | Method | Reference | Comment |
---|---|---|---|---|---|
ΔfH°solid | -436.9 ± 1.0 | kJ/mol | Ccb | Hamilton and Witt, 1971 | |
Quantity | Value | Units | Method | Reference | Comment |
ΔcH°solid | -3854.6 ± 0.96 | kJ/mol | Ccb | Hamilton and Witt, 1971 |

Phase change data

Data compiled by: Hussein Y. Afeefy, Joel F. Liebman, and Stephen E. Stein
Quantity | Value | Units | Method | Reference | Comment |
---|---|---|---|---|---|
ΔsubH° | 54.4 ± 4.2 | kJ/mol | V | Hamilton and Witt, 1971 |

References

Stewart, 2004
Stewart, J.J.P.,
Comparison of the accuracy of semiempirical and some DFT methods for predicting heats of formation,
J. Mol. Model, 2004, 10, 1, 6-10, https://doi.org/10.1007/s00894-003-0157-6
. [all data]
Hamilton and Witt, 1971
Hamilton, W.S.; Witt, L.C.,
Heat of combustion of isophthalamide,
J. Chem. Eng. Data, 1971, 16, 234-235. [all data]