methyl (R)-lactate
- Formula: C4H8O3
- Molecular weight: 104.1045
- IUPAC Standard InChIKey: LPEKGGXMPWTOCB-GSVOUGTGSA-N
- CAS Registry Number: 17392-83-5
- Chemical structure:
View 3d structure (requires JavaScript / HTML 5) - Stereoisomers:
- Other names: Propanoic acid, 2-hydroxy-, methyl ester, (R)-

Phase change data

Data compiled by: Robert L. Brown and Stephen E. Stein
Quantity | Value | Units | Method | Reference | Comment |
---|---|---|---|---|---|
Tboil | 417.7 | K | N/A | Aldrich Chemical Company Inc., 1990 |

References

Aldrich Chemical Company Inc., 1990
Aldrich Chemical Company Inc.,
Catalog Handbook of Fine Chemicals, Aldrich Chemical Company, Inc., Milwaukee WI, 1990, 1. [all data]