Benzenemethanol, 2-methyl-, acetate
- Formula: C10H12O2
- Molecular weight: 164.2011
- IUPAC Standard InChIKey: BKKDUUVBVHYZFA-UHFFFAOYSA-N
- CAS Registry Number: 17373-93-2
- Chemical structure:
View 3d structure (requires JavaScript / HTML 5) - Other names: Benzyl alcohol, o-methyl-, acetate; o-Methylbenzyl acetate; Acetic acid, (2-methylphenyl)methyl ester

Van Den Dool and Kratz RI, non-polar column, temperature ramp

Column type | Active phase | I | Reference | Comment |
---|---|---|---|---|
Capillary | 5 % Phenyl methyl siloxane | 1287. | Zaikin, 2010 | 30. m/0.25 mm/0.25 μm, 15. K/min, 270. C @ 15. min; Tstart: 60. C |

References

Zaikin, 2010
Zaikin, V.G.,
Personal communication: Retention indices measured during 2010, 2010. [all data]