(1β,3α,5α)-3,5-Dimethyl-cyclohexanol
- Formula: C8H16O
- Molecular weight: 128.2120
- IUPAC Standard InChIKey: WIYNOPYNRFPWNB-JIGDXULJSA-N
- CAS Registry Number: 17373-17-0
- Chemical structure:
View 3d structure (requires JavaScript / HTML 5) - Stereoisomers:

Condensed phase thermochemistry data

Data compiled by: Hussein Y. Afeefy, Joel F. Liebman, and Stephen E. Stein
Quantity | Value | Units | Method | Reference | Comment |
---|---|---|---|---|---|
ΔcH°liquid | -1183.0 ± 2.7 | kcal/mol | Ccb | Skita and Faust, 1939 | Reanalyzed by Cox and Pilcher, 1970, Original value = -1182.13 kcal/mol; Corresponding ΔfHºliquid = -115.93 kcal/mol (simple calculation by NIST; no Washburn corrections) |

References

Skita and Faust, 1939
Skita, A.; Faust, W.,
Zur konfigurationsbestimmung 1.3-substituierter cyclohexanole,
Ber., 1939, 72, 1127-1139. [all data]
Cox and Pilcher, 1970
Cox, J.D.; Pilcher, G.,
Thermochemistry of Organic and Organometallic Compounds, Academic Press, New York, 1970, 1-636. [all data]