Dicyclopenta[cd,fg]pyrene
- Formula: C20H10
- Molecular weight: 250.2934
- IUPAC Standard InChIKey: QXSDCABVNSUOIG-UHFFFAOYSA-N
- CAS Registry Number: 173678-72-3
- Chemical structure:
View 3d structure (requires JavaScript / HTML 5) - Permanent link for this species. Use this link for bookmarking this species for future reference.

Gas phase thermochemistry data

Data compiled by: Glushko Thermocenter, Russian Academy of Sciences, Moscow
Constant pressure heat capacity of gas
Cp,gas (J/mol*K) | Temperature (K) | Reference | Comment |
---|---|---|---|
41.39 | 50. | Dorofeeva O.V., 1989 | These statistically calculated values were obtained using force field approximation for polycyclic aromatic hydrocarbons to estimate the needed vibrational frequencies (see also [ Dorofeeva O.V., 1986, Moiseeva N.F., 1990]). These functions are reproduced in the reference book [ Frenkel M., 1994]. |
69.00 | 100. | ||
107.19 | 150. | ||
150.29 | 200. | ||
215.83 | 273.15 | ||
237.9 ± 3.0 | 298.15 | ||
239.52 | 300. | ||
321.38 | 400. | ||
389.49 | 500. | ||
443.96 | 600. | ||
487.30 | 700. | ||
522.13 | 800. | ||
550.47 | 900. | ||
573.81 | 1000. | ||
593.23 | 1100. | ||
609.51 | 1200. | ||
623.27 | 1300. | ||
634.98 | 1400. | ||
644.99 | 1500. |

References

Dorofeeva O.V., 1989
Dorofeeva O.V.,
Thermodynamic Properties of Gaseous Polycyclic Aromatic Hydrocarbons Containing Five-Membered Rings. Institute for High Temperatures, USSR Academy of Sciences, Preprint No.1-263 (in Russian), Moscow, 1989. [all data]
Dorofeeva O.V., 1986
Dorofeeva O.V.,
On calculation of thermodynamic properties of polycyclic aromatic hydrocarbons,
Thermochim. Acta, 1986, 102, 59-66. [all data]
Moiseeva N.F., 1990
Moiseeva N.F.,
Group additivity scheme for calculating the chemical thermodynamic properties of gaseous polycyclic aromatic hydrocarbons containing five-membered rings,
Thermochim. Acta, 1990, 168, 179-186. [all data]
Frenkel M., 1994
Frenkel M.,
Thermodynamics of Organic Compounds in the Gas State, Vol. I, II, Thermodynamics Research Center, College Station, Texas, 1994, 1994. [all data]