1-Ethynylcyclopentanol
- Formula: C7H10O
- Molecular weight: 110.1537
- IUPAC Standard InChIKey: LQMDOONLLAJAPZ-UHFFFAOYSA-N
- CAS Registry Number: 17356-19-3
- Chemical structure:
View 3d structure (requires JavaScript / HTML 5) - Other names: 1-Ethynyl-1-cyclopentanol; Cyclopentanol, 1-ethynyl-

Phase change data

Data compiled as indicated in comments:
BS - Robert L. Brown and Stephen E. Stein
AC - William E. Acree, Jr., James S. Chickos
Quantity | Value | Units | Method | Reference | Comment |
---|---|---|---|---|---|
Tboil | 430. | K | N/A | Farchan Laboratories, 1990 | BS |
Tboil | 430.7 | K | N/A | Weast and Grasselli, 1989 | BS |
Quantity | Value | Units | Method | Reference | Comment |
ΔvapH° | 62.1 | kJ/mol | CGC | Chickos, Hosseini, et al., 1995 | Based on data from 323. to 373. K.; AC |

References

Farchan Laboratories, 1990
Farchan Laboratories,
Research Chemicals Catalog, Farchan Laboratories, Gainesville, FL, 1990, 91. [all data]
Weast and Grasselli, 1989
CRC Handbook of Data on Organic Compounds, 2nd Editon, Weast,R.C and Grasselli, J.G., ed(s)., CRC Press, Inc., Boca Raton, FL, 1989, 1. [all data]
Chickos, Hosseini, et al., 1995
Chickos, James S.; Hosseini, Sarah; Hesse, Donald G.,
Determination of vaporization enthalpies of simple organic molecules by correlations of changes in gas chromatographic net retention times,
Thermochimica Acta, 1995, 249, 41-62, https://doi.org/10.1016/0040-6031(95)90670-3
. [all data]