Octanedioic acid, dimethyl ester
- Formula: C10H18O4
- Molecular weight: 202.2475
- IUPAC Standard InChIKey: LNLCRJXCNQABMV-UHFFFAOYSA-N
- CAS Registry Number: 1732-09-8
- Chemical structure:
View 3d structure (requires JavaScript / HTML 5) - Other names: Suberic acid, dimethyl ester; Dimethyl octanedioate; Dimethyl suberate; Dimethyl ester of octanedioic acid; Octandioic acid, dimethyl ester

Condensed phase thermochemistry data

Data compiled by: Hussein Y. Afeefy, Joel F. Liebman, and Stephen E. Stein
Quantity | Value | Units | Method | Reference | Comment |
---|---|---|---|---|---|
ΔcH°solid | -5574.3 | kJ/mol | Ccb | Verkade, Coops, et al., 1926 | Heat of combustion at 15°C; Corresponding ΔfHºsolid = -933.0 kJ/mol (simple calculation by NIST; no Washburn corrections) |

Phase change data

Data compiled as indicated in comments:
BS - Robert L. Brown and Stephen E. Stein
AC - William E. Acree, Jr., James S. Chickos
Quantity | Value | Units | Method | Reference | Comment |
---|---|---|---|---|---|
Tboil | 541.2 | K | N/A | Weast and Grasselli, 1989 | BS |
Quantity | Value | Units | Method | Reference | Comment |
ΔvapH° | 78.1 ± 0.2 | kJ/mol | GS | Verevkin, Kozlova, et al., 2006 | Based on data from 293. to 352. K.; AC |
Reduced pressure boiling point
Tboil (K) | Pressure (bar) | Reference | Comment |
---|---|---|---|
418. to 421. | 0.024 | Frinton Laboratories Inc., 1986 | BS |

Kovats' RI, non-polar column, isothermal

Column type | Active phase | Temperature (C) | I | Reference | Comment |
---|---|---|---|---|---|
Capillary | SE-54 | 140. | 1449. | Grigor'eva, Vasil'ev, et al., 1993 | 15. m/0.28 mm/2.4 μm, Ar |
Capillary | SE-54 | 160. | 1448. | Grigor'eva, Vasil'ev, et al., 1993 | 15. m/0.28 mm/2.4 μm, Ar |
Capillary | SE-54 | 180. | 1448. | Grigor'eva, Vasil'ev, et al., 1993 | 15. m/0.28 mm/2.4 μm, Ar |
Capillary | Ultra-1 | 100. | 1412. | Herrmann, Dufka, et al., 1986 | 25. m/0.20 mm/0.32 μm, N2 |
Capillary | Ultra-1 | 125. | 1410. | Herrmann, Dufka, et al., 1986 | 25. m/0.20 mm/0.32 μm, N2 |
Capillary | Ultra-1 | 150. | 1410. | Herrmann, Dufka, et al., 1986 | 25. m/0.20 mm/0.32 μm, N2 |
Capillary | Ultra-1 | 175. | 1410. | Herrmann, Dufka, et al., 1986 | 25. m/0.20 mm/0.32 μm, N2 |

Kovats' RI, polar column, isothermal

Column type | Active phase | Temperature (C) | I | Reference | Comment |
---|---|---|---|---|---|
Capillary | PEG-40M | 120. | 1973. | Grigor'eva, Vasil'ev, et al., 1993 | 40. m/0.25 mm/0.10 μm, Ar |
Capillary | PEG-40M | 120. | 2010. | Grigor'eva, Vasil'ev, et al., 1993 | 40. m/0.25 mm/0.10 μm, Ar |

Van Den Dool and Kratz RI, non-polar column, temperature ramp

Column type | Active phase | I | Reference | Comment |
---|---|---|---|---|
Capillary | DB-1 | 1409. | Johnson, Urso, et al., 1997 | 30. m/0.2 mm/0.25 μm, 50. C @ 2. min, 5. K/min, 300. C @ 5. min |
Capillary | DB-1 | 1409. | Johnson, Urso, et al., 1997 | 30. m/0.2 mm/0.25 μm, 50. C @ 2. min, 5. K/min, 300. C @ 5. min |
Capillary | OV-1 | 1407. | Tan, Holland, et al., 1988 | He, 8. K/min, 280. C @ 10. min; Column length: 25. m; Column diameter: 0.32 mm; Tstart: 40. C |
Capillary | DB-5 | 1447. | Rostad and Pereira, 1986 | 30. m/0.26 mm/0.25 μm, He, 50. C @ 4. min, 6. K/min, 300. C @ 20. min |
Packed | SE-30 | 1416. | van den Dool and Kratz, 1963 | Celite; Tstart: 75. C; Tend: 228. C |

Van Den Dool and Kratz RI, non-polar column, custom temperature program

Column type | Active phase | I | Reference | Comment |
---|---|---|---|---|
Capillary | VF-5MS | 1447.3 | Tret'yakov, 2008 | 30. m/0.25 mm/0.25 μm, He; Program: Multi-step temperature program; T(initial)=60C; T(final)=270C |

Van Den Dool and Kratz RI, polar column, temperature ramp

Column type | Active phase | I | Reference | Comment |
---|---|---|---|---|
Packed | Carbowax 20M | 2010. | van den Dool and Kratz, 1963 | Celite 545, 4.6 K/min; Tstart: 75. C; Tend: 228. C |

Normal alkane RI, non-polar column, temperature ramp

Column type | Active phase | I | Reference | Comment |
---|---|---|---|---|
Capillary | HP-5 MS | 1446. | Vedernikov, Shabanova, et al., 2011 | 30. m/0.25 mm/0.25 μm, Helium, 5. K/min, 280. C @ 5. min; Tstart: 150. C |
Capillary | HP-5MS | 1449. | Hadaruga, Hadaruga, et al., 2006 | 30. m/0.25 mm/0.25 μm, He, 4. K/min; Tstart: 50. C; Tend: 250. C |
Capillary | Ultra-1 | 1410. | Okumura, 1991 | 25. m/0.32 mm/0.25 μm, He, 3. K/min; Tstart: 80. C; Tend: 260. C |
Capillary | OV-101 | 1410. | Pinkston, Spiteller, et al., 1981 | H2, 80. C @ 7. min, 2. K/min; Column length: 30. m; Column diameter: 0.3 mm; Tend: 275. C |
Capillary | OV-101 | 1410. | Spiteller and Spiteller, 1979 | He, 75. C @ 7. min, 2. K/min; Column length: 25. m; Tend: 280. C |

Normal alkane RI, non-polar column, custom temperature program

Column type | Active phase | I | Reference | Comment |
---|---|---|---|---|
Capillary | SE-30 | 1414. | Vinogradov, 2004 | Program: not specified |
Capillary | HP-1 | 1412. | Rowland, Blackman, et al., 1995 | 25. m/0.25 mm/0.25 μm; Program: 30 0C (4 min) 6 K/min -> 200 0C 15 K/min -> 250 0C (20 min) |

Normal alkane RI, polar column, custom temperature program

Column type | Active phase | I | Reference | Comment |
---|---|---|---|---|
Capillary | Carbowax 20M | 1985. | Vinogradov, 2004 | Program: not specified |
Capillary | Carbowax 20M | 2010. | Peppard and Ramus, 1988 | He; Program: not specified |

Lee's RI, non-polar column, temperature ramp

Column type | Active phase | I | Reference | Comment |
---|---|---|---|---|
Capillary | DB-1 | 249.3 | Johnson, Urso, et al., 1997 | 30. m/0.2 mm/0.25 μm, 50. C @ 2. min, 5. K/min, 300. C @ 5. min |
Capillary | DB-1 | 249.3 | Johnson, Urso, et al., 1997 | 30. m/0.2 mm/0.25 μm, 50. C @ 2. min, 5. K/min, 300. C @ 5. min |
Capillary | DB-5 | 247.42 | Rostad and Pereira, 1986 | 30. m/0.26 mm/0.25 μm, He, 50. C @ 4. min, 6. K/min, 300. C @ 20. min |

References

Verkade, Coops, et al., 1926
Verkade, P.E.; Coops, J.; Hartman, H.,
Calorimetric researches. XIII. Heats of combustion of successive terms of homologous series: Dimethyl esters of the oxalic acid series. A general survey of the oscillation phenomena,
Recl. Trav. Chim. Pays-Bas, 1926, 45, 585-606. [all data]
Weast and Grasselli, 1989
CRC Handbook of Data on Organic Compounds, 2nd Editon, Weast,R.C and Grasselli, J.G., ed(s)., CRC Press, Inc., Boca Raton, FL, 1989, 1. [all data]
Verevkin, Kozlova, et al., 2006
Verevkin, Sergey P.; Kozlova, Svetlana A.; Emel'yanenko, Vladimir N.; Nikitin, Eugene D.; Popov, Alexander P.; Krasnykh, Eugen L.,
Vapor Pressures, Enthalpies of Vaporization, and Critical Parameters of a Series of Linear Aliphatic Dimethyl Esters of Dicarboxylic Acids,
J. Chem. Eng. Data, 2006, 51, 5, 1896-1905, https://doi.org/10.1021/je0602418
. [all data]
Frinton Laboratories Inc., 1986
Frinton Laboratories Inc.,
Catalog Number 11, Frinton Laboratories Inc., Vineland, NJ, 1986, 99. [all data]
Grigor'eva, Vasil'ev, et al., 1993
Grigor'eva, D.N.; Vasil'ev, A.V.; Golovnya, R.V.,
Effect of the temperature on the retention indices in homologous series of bifunctional compounds under capillary gas chromatography conditions,
J. Anal. Chem. USSR (Engl. Transl.), 1993, 48, 7, 817-822. [all data]
Herrmann, Dufka, et al., 1986
Herrmann, F.; Dufka, O.; Churacek, J.,
Fused-Silica Capillary Gas Chromatography-Mass Spectrometry of Some Dicarboxylic Acids Present in Condensation-Type Polymers I. Dimethyl Esters,
J. Chromatogr., 1986, 360, 79-88, https://doi.org/10.1016/S0021-9673(00)91653-4
. [all data]
Johnson, Urso, et al., 1997
Johnson, C.I.; Urso, A.; Geleta, L.,
Broad spectrum analysis of municipal and industrial effluents discharged into the Peace, Athabasca and Slave river basins: characterization of effluent samples, 1994 - Volume 1 of 2, Northern River Basins Study Project Report No. 121, Norther River Basins Study, Edmonton, Alberta, 1997, 27. [all data]
Tan, Holland, et al., 1988
Tan, S.-T.; Holland, P.T.; Wilkins, A.L.; Molan, P.C.,
Extractives from New Zealand honeys. 1. White clovers, manuka, and kanuka unifloral honeys,
J. Agric. Food Chem., 1988, 36, 3, 453-460, https://doi.org/10.1021/jf00081a012
. [all data]
Rostad and Pereira, 1986
Rostad, C.E.; Pereira, W.E.,
Kovats and Lee retention indices determined by gas chromatography/mass spectrometry for organic compounds of environmental interest,
J. Hi. Res. Chromatogr. Chromatogr. Comm., 1986, 9, 6, 328-334, https://doi.org/10.1002/jhrc.1240090603
. [all data]
van den Dool and Kratz, 1963
van den Dool, H.; Kratz, P. Dec.,
A generalization of the retention index system including linear temperature programmed gas-liquid partition chromatography,
J. Chromatogr., 1963, 11, 463-471, https://doi.org/10.1016/S0021-9673(01)80947-X
. [all data]
Tret'yakov, 2008
Tret'yakov, K.V.,
Retention Data. NIST Mass Spectrometry Data Center., NIST Mass Spectrometry Data Center, 2008. [all data]
Vedernikov, Shabanova, et al., 2011
Vedernikov, D.N.; Shabanova, N.Yu.; Roshchin, V.I.,
Change in the chemical composition of the crust and inner bark of the Betula pendula Roth. Birch (Betulaceae) with tree height,
Rus. J. Bioorg. Chem., 2011, 37, 7, 877-882, https://doi.org/10.1134/S1068162011070259
. [all data]
Hadaruga, Hadaruga, et al., 2006
Hadaruga, N.G.; Hadaruga, D.I.; Paunescu, V.; Tatu, C.; Ordodi, V.L.; Bandur, G.; Lupea, A.X.,
Thermal stability of the linoleic acid/α- and β-cyclodextrin complexes,
Food Chem., 2006, 99, 3, 500-508, https://doi.org/10.1016/j.foodchem.2005.08.012
. [all data]
Okumura, 1991
Okumura, T.,
retention indices of environmental chemicals on methyl silicone capillary column,
Journal of Environmental Chemistry (Japan), 1991, 1, 2, 333-358, https://doi.org/10.5985/jec.1.333
. [all data]
Pinkston, Spiteller, et al., 1981
Pinkston, D.; Spiteller, G.; von Henning, H.; Matthaei, D.,
High-resolution gas chromatography-mass spectrometry of the methyl esters of organic acids from uremic hemofiltrates,
J. Chromatogr., 1981, 223, 1, 1-19, https://doi.org/10.1016/S0378-4347(00)80063-8
. [all data]
Spiteller and Spiteller, 1979
Spiteller, M.; Spiteller, G.,
Trennung und charakterisierung saurer harnbest and- teile,
J. Chromatogr., 1979, 164, 3, 253-317, https://doi.org/10.1016/S0378-4347(00)81232-3
. [all data]
Vinogradov, 2004
Vinogradov, B.A.,
Production, composition, properties and application of essential oils, 2004, retrieved from http://viness.narod.ru. [all data]
Rowland, Blackman, et al., 1995
Rowland, C.Y.; Blackman, A.J.; D'Arcy, B.R.; Rintoul, G.B.,
Comparison of organic extractives found in leatherwood (Eucryphia lucida) honey and leatherwood flowers and leaves,
J. Agric. Food Chem., 1995, 43, 3, 753-763, https://doi.org/10.1021/jf00051a036
. [all data]
Peppard and Ramus, 1988
Peppard, T.L.; Ramus, S.A.,
Use of Kovats' gas chromatographic retention indices in beer flavor studies,
Am. Soc. Brew. Chem. Proc., 1988, 46, 2, 26-30. [all data]