Heptadecanoic acid, methyl ester
- Formula: C18H36O2
- Molecular weight: 284.4772
- IUPAC Standard InChIKey: HUEBIMLTDXKIPR-UHFFFAOYSA-N
- CAS Registry Number: 1731-92-6
- Chemical structure:
View 3d structure (requires JavaScript / HTML 5) - Other names: Margaric acid methyl ester; Methyl heptadecanoate; Methyl margarate; n-Heptadecanoic acid methyl ester; methyl heptadecanoate (17:0); 27:0, Me ester

Phase change data

Data compiled as indicated in comments:
TRC - Thermodynamics Research Center, NIST Boulder Laboratories, Chris Muzny director
AC - William E. Acree, Jr., James S. Chickos
Quantity | Value | Units | Method | Reference | Comment |
---|---|---|---|---|---|
Tfus | 302.25 | K | N/A | Gaikwad and Subrahmanyam, 1985 | Uncertainty assigned by TRC = 0.4 K; TRC |
Quantity | Value | Units | Method | Reference | Comment |
ΔvapH° | 100.8 ± 1.0 | kJ/mol | CGC | Chickos, Zhao, et al., 2004 | Based on data from 467. to 558. K.; AC |
ΔvapH° | 97.0 ± 1.2 | kJ/mol | N/A | van Genderen, van Miltenburg, et al., 2002 | AC |
Enthalpy of vaporization
ΔvapH (kJ/mol) | Temperature (K) | Method | Reference | Comment |
---|---|---|---|---|
89.3 | 350. | N/A | van Genderen, van Miltenburg, et al., 2002 | AC |
89.0 ± 0.7 | 353. | N/A | van Genderen, van Miltenburg, et al., 2002 | AC |
84.4 | 436. | A,EST | Stephenson and Malanowski, 1987 | Based on data from 421. to 525. K. See also Rose and Schrodt, 1963.; AC |
Enthalpy of fusion
ΔfusH (kJ/mol) | Temperature (K) | Method | Reference | Comment |
---|---|---|---|---|
48.1 | 304.2 | DSC | Chickos, Zhao, et al., 2004 | AC |

Van Den Dool and Kratz RI, non-polar column, temperature ramp

Data compiled by: NIST Mass Spectrometry Data Center, William E. Wallace, director

Column type CapillaryCapillaryCapillaryCapillaryCapillary
Active phase DB-5DB-1DB-1BP-1DB-5
Column length (m) 30.30.30.12.30.
Carrier gas He  H2He
Substrate
Column diameter (mm) 0.320.20.2 0.26
Phase thickness (μm) 0.250.250.25 0.25
Tstart (C) 40.50.50.40.50.
Tend (C) 250.300.300.240.300.
Heat rate (K/min) 5.5.5.4.6.
Initial hold (min) 2.2.2.2.4.
Final hold (min) 5.5.5.75.20.
I 2028.2008.2008.2010.2028.
ReferenceWu, Zorn, et al., 2007Johnson, Urso, et al., 1997Johnson, Urso, et al., 1997Tan, Wilkins, et al., 1989Rostad and Pereira, 1986
Comment MSDC-RI MSDC-RI MSDC-RI MSDC-RI MSDC-RI

Normal alkane RI, non-polar column, isothermal

Data compiled by: NIST Mass Spectrometry Data Center, William E. Wallace, director

Column type Capillary
Active phase DB-1
Column length (m)
Carrier gas
Substrate
Column diameter (mm)
Phase thickness (μm)
Temperature (C) 200.
I 2009.
ReferenceAryusuk and Krisnangkura, 2003
Comment MSDC-RI

Normal alkane RI, non-polar column, temperature ramp

Data compiled by: NIST Mass Spectrometry Data Center, William E. Wallace, director

Column type CapillaryCapillaryCapillaryCapillaryCapillary
Active phase HP-5 MSRTx-1HP-5 MSBPX-5HP-5
Column length (m) 30.60.30.25.30.
Carrier gas HeliumHeliumHeliumHeHelium
Substrate
Column diameter (mm) 0.250.220.250.220.32
Phase thickness (μm) 0.250.250.250.250.25
Tstart (C) 150.60.35.50.40.
Tend (C) 280.230.195.300.250.
Heat rate (K/min) 5.2.2.5.5.
Initial hold (min)   5.5.2.
Final hold (min) 5.35.30. 5.
I 2021.2008.2024.2026.2028.
ReferenceVedernikov, Shabanova, et al., 2011Dib, Bendahou, et al., 2010Kim and Chung, 2009Dickschat, Bode, et al., 2005N/A
Comment MSDC-RI MSDC-RI MSDC-RI MSDC-RI MSDC-RI
Column type CapillaryCapillaryCapillaryCapillaryCapillary
Active phase DB-5BPX-5HP-1DB-1DB-5
Column length (m) 30.50.12.30.30.
Carrier gas HeHeHeHeN2
Substrate
Column diameter (mm) 0.250.220.220.250.25
Phase thickness (μm) 0.250.2533. 0.215
Tstart (C) 40.50.140.70.50.
Tend (C) 290.250.300.300.300.
Heat rate (K/min) 4.3.20.3.6.
Initial hold (min)  1.0.55.4.
Final hold (min)  10.3. 20.
I 2022.2037.2007.2005.2029.
Referenceda Camara, Shepherd, et al., 2002D'Arcy, Rintoul, et al., 1997Amijee, Cheung, et al., 1996Guy and Vernin, 1996Wang, Jin, et al., 1992
Comment MSDC-RI MSDC-RI MSDC-RI MSDC-RI MSDC-RI
Column type Capillary
Active phase Ultra-1
Column length (m) 25.
Carrier gas He
Substrate
Column diameter (mm) 0.32
Phase thickness (μm) 0.25
Tstart (C) 80.
Tend (C) 260.
Heat rate (K/min) 3.
Initial hold (min)
Final hold (min)
I 2007.
ReferenceOkumura, 1991
Comment MSDC-RI

Van Den Dool and Kratz RI, non-polar column, custom temperature program

Data compiled by: NIST Mass Spectrometry Data Center, William E. Wallace, director

Column type CapillaryCapillary
Active phase HP-5DB-1
Column length (m) 30.15.
Carrier gas HeHe
Substrate
Column diameter (mm) 0.250.53
Phase thickness (μm) 0.251.
Program 50C => 6C/min => 100C => 4C/min => 280C40C(3min) => 8C/min => 200(1min) => 5C/min => 300C(25min)
I 2030.2009.
ReferenceIsidorov, Krajewska, et al., 2001Peng, 2000
Comment MSDC-RI MSDC-RI

References

Gaikwad and Subrahmanyam, 1985
Gaikwad, B.R.; Subrahmanyam, V.V.,
Melting behavior of fatty alcohols and their binary blends.,
J. Indian Chem. Soc., 1985, 62, 513. [all data]
Chickos, Zhao, et al., 2004
Chickos, James S.; Zhao, Hui; Nichols, Gary,
The vaporization enthalpies and vapor pressures of fatty acid methyl esters C18, C21 to C23, and C25 to C29 by correlation -- gas chromatography,
Thermochimica Acta, 2004, 424, 1-2, 111-121, https://doi.org/10.1016/j.tca.2004.05.020
. [all data]
van Genderen, van Miltenburg, et al., 2002
van Genderen, Aad C.G.; van Miltenburg, J. Cees; Blok, Jacobus G.; van Bommel, Mark J.; van Ekeren, Paul J.; van den Berg, Gerrit J.K.; Oonk, Harry A.J.,
Liquid--vapour equilibria of the methyl esters of alkanoic acids: vapour pressures as a function of temperature and standard thermodynamic function changes,
Fluid Phase Equilibria, 2002, 202, 1, 109-120, https://doi.org/10.1016/S0378-3812(02)00097-3
. [all data]
Stephenson and Malanowski, 1987
Stephenson, Richard M.; Malanowski, Stanislaw,
Handbook of the Thermodynamics of Organic Compounds, 1987, https://doi.org/10.1007/978-94-009-3173-2
. [all data]
Rose and Schrodt, 1963
Rose, Arthur; Schrodt, Verle N.,
Correlation and Prediction of Vapor Pressures of Homologs. Use of Structure Parameters and Gas Chromatography Data.,
J. Chem. Eng. Data, 1963, 8, 1, 9-13, https://doi.org/10.1021/je60016a002
. [all data]