Tridecanoic acid, methyl ester
- Formula: C14H28O2
- Molecular weight: 228.3709
- IUPAC Standard InChIKey: JNDDPBOKWCBQSM-UHFFFAOYSA-N
- CAS Registry Number: 1731-88-0
- Chemical structure:
View 3d structure (requires JavaScript / HTML 5) - Other names: Methyl tridecanoate; n-Tridecanoic acid methyl ester; Methyl ester of tridecanoic acid; Methyl n-tridecanoate; Methyl tridecanoate ester

Condensed phase thermochemistry data

Data compiled by: Hussein Y. Afeefy, Joel F. Liebman, and Stephen E. Stein
Quantity | Value | Units | Method | Reference | Comment |
---|---|---|---|---|---|
ΔcH°liquid | -8792.4 ± 1.8 | kJ/mol | Ccb | Adriaanse, Dekker, et al., 1965 | Corresponding ΔfHºliquid = -718.4 kJ/mol (simple calculation by NIST; no Washburn corrections) |

Phase change data

Data compiled as indicated in comments:
BS - Robert L. Brown and Stephen E. Stein
TRC - Thermodynamics Research Center, NIST Boulder Laboratories, Chris Muzny director
AC - William E. Acree, Jr., James S. Chickos
ALS - Hussein Y. Afeefy, Joel F. Liebman, and Stephen E. Stein
Quantity | Value | Units | Method | Reference | Comment |
---|---|---|---|---|---|
Tfus | 278.25 | K | N/A | Gaikwad and Subrahmanyam, 1985 | Uncertainty assigned by TRC = 0.35 K; TRC |
Tfus | 279. | K | N/A | Adriaanse, Dekker, et al., 1964 | Uncertainty assigned by TRC = 0.05 K; TRC |
Quantity | Value | Units | Method | Reference | Comment |
ΔvapH° | 82. ± 2. | kJ/mol | AVG | N/A | Average of 6 values; Individual data points |
Reduced pressure boiling point
Tboil (K) | Pressure (bar) | Reference | Comment |
---|---|---|---|
404.2 | 0.005 | Aldrich Chemical Company Inc., 1990 | BS |
365.7 | 0.001 | Weast and Grasselli, 1989 | BS |
Enthalpy of vaporization
ΔvapH (kJ/mol) | Temperature (K) | Method | Reference | Comment |
---|---|---|---|---|
74.0 | 350. | N/A | van Genderen, van Miltenburg, et al., 2002 | AC |
72.3 ± 0.1 | 368. | N/A | van Genderen, van Miltenburg, et al., 2002 | AC |
72.6 | 392. | A,EST | Stephenson and Malanowski, 1987 | Based on data from 377. to 504. K. See also Rose and Schrodt, 1963.; AC |

Kovats' RI, non-polar column, isothermal

Column type | Active phase | Temperature (C) | I | Reference | Comment |
---|---|---|---|---|---|
Capillary | CP Sil 5 CB | 240. | 1609. | Hanai and Hong, 1989 | 30. m/0.25 mm/0.25 μm |
Capillary | DB-1 | 240. | 1615. | Hanai and Hong, 1989 | 30. m/0.25 mm/0.25 μm |
Capillary | SE-30 | 140. | 1607. | Haken and Korhonen, 1984 | N2; Column length: 25. m; Column diameter: 0.22 mm |

Kovats' RI, non-polar column, temperature ramp

Column type | Active phase | I | Reference | Comment |
---|---|---|---|---|
Capillary | OV-101 | 1622. | Ohnishi and Shibamoto, 1984 | 2. K/min; Column length: 50. m; Column diameter: 0.23 mm; Tstart: 80. C; Tend: 200. C |

Kovats' RI, polar column, isothermal

Column type | Active phase | Temperature (C) | I | Reference | Comment |
---|---|---|---|---|---|
Capillary | CP-Wax | 240. | 1906. | Hanai and Hong, 1989 | 25. m/0.25 mm/0.22 μm |
Capillary | DB-Wax | 240. | 1936. | Hanai and Hong, 1989 | 25. m/0.25 mm/0.22 μm |
Capillary | Carbowax 20M | 140. | 1866. | Haken and Korhonen, 1984 | N2; Column length: 22. m; Column diameter: 0.3 mm |

Van Den Dool and Kratz RI, non-polar column, temperature ramp

Column type | Active phase | I | Reference | Comment |
---|---|---|---|---|
Capillary | HP-5MS | 1631. | Pino, Mesa, et al., 2005 | 30. m/0.25 mm/0.25 μm, He, 60. C @ 2. min, 4. K/min, 250. C @ 20. min |
Capillary | DB-5 | 1625. | Rostad and Pereira, 1986 | 30. m/0.26 mm/0.25 μm, He, 50. C @ 4. min, 6. K/min, 300. C @ 20. min |

Van Den Dool and Kratz RI, non-polar column, custom temperature program

Column type | Active phase | I | Reference | Comment |
---|---|---|---|---|
Capillary | VF-5MS | 1624.4 | Tret'yakov, 2008 | 30. m/0.25 mm/0.25 μm, He; Program: Multi-step temperature program; T(initial)=60C; T(final)=270C |
Capillary | DB-1 | 1606. | Peng, 2000 | 15. m/0.53 mm/1. μm, He; Program: 40C(3min) => 8C/min => 200(1min) => 5C/min => 300C(25min) |

Van Den Dool and Kratz RI, polar column, temperature ramp

Column type | Active phase | I | Reference | Comment |
---|---|---|---|---|
Capillary | DB-Wax | 1911. | Peng, 2000 | 15. m/0.53 mm/1. μm, He, 40. C @ 3. min, 5. K/min, 220. C @ 30. min |
Capillary | HP-Wax | 1913. | Peng, 2000 | 15. m/0.53 mm/1. μm, He, 40. C @ 3. min, 5. K/min, 220. C @ 30. min |

Normal alkane RI, non-polar column, temperature ramp

Column type | Active phase | I | Reference | Comment |
---|---|---|---|---|
Capillary | RTx-1 | 1608. | Dib, Bendahou, et al., 2010 | 60. m/0.22 mm/0.25 μm, Helium, 2. K/min, 230. C @ 35. min; Tstart: 60. C |
Capillary | HP-5 | 1605. | Bousaada, Ammar, et al., 2008 | 30. m/0.25 mm/0.25 μm, Nitrogen, 50. C @ 1. min, 5. K/min, 280. C @ 1. min |
Capillary | BPX-5 | 1626. | Dickschat, Bode, et al., 2005 | 25. m/0.22 mm/0.25 μm, He, 50. C @ 5. min, 5. K/min; Tend: 300. C |
Capillary | HP-1 | 1617. | Amijee, Cheung, et al., 1996 | 12. m/0.22 mm/33. μm, He, 140. C @ 0.5 min, 20. K/min, 300. C @ 3. min |
Capillary | DB-1 | 1605. | Guy and Vernin, 1996 | He, 70. C @ 5. min, 3. K/min; Column length: 30. m; Column diameter: 0.25 mm; Tend: 300. C |
Capillary | Ultra-1 | 1607. | Okumura, 1991 | 25. m/0.32 mm/0.25 μm, He, 3. K/min; Tstart: 80. C; Tend: 260. C |

Normal alkane RI, non-polar column, custom temperature program

Column type | Active phase | I | Reference | Comment |
---|---|---|---|---|
Capillary | RTx-1 | 1605. | Dib, Bendahou, et al., 2010 | 60. m/0.22 mm/0.25 μm, Helium; Program: not specified |
Capillary | SE-30 | 1612. | Vinogradov, 2004 | Program: not specified |

Normal alkane RI, polar column, custom temperature program

Column type | Active phase | I | Reference | Comment |
---|---|---|---|---|
Capillary | DB-Wax | 1921. | Welke, Manfroi, et al., 2012 | 30. m/0.25 mm/0.25 μm, Helium; Program: not specified |
Capillary | Carbowax 20M | 1895. | Vinogradov, 2004 | Program: not specified |

Lee's RI, non-polar column, temperature ramp

Column type | Active phase | I | Reference | Comment |
---|---|---|---|---|
Capillary | DB-5 | 275.62 | Rostad and Pereira, 1986 | 30. m/0.26 mm/0.25 μm, He, 50. C @ 4. min, 6. K/min, 300. C @ 20. min |

Lee's RI, non-polar column, custom temperature program

Column type | Active phase | I | Reference | Comment |
---|---|---|---|---|
Capillary | Polydimethyl siloxanes | 275.62 | Eckel and Kind, 2003 | Program: not specified |

References

Adriaanse, Dekker, et al., 1965
Adriaanse, N.; Dekker, H.; Coops, J.,
Heats of combustion of normal saturated fatty acids and their methyl esters,
Rec. Trav. Chim. Pays/Bas, 1965, 84, 393-407. [all data]
Gaikwad and Subrahmanyam, 1985
Gaikwad, B.R.; Subrahmanyam, V.V.,
Melting behavior of fatty alcohols and their binary blends.,
J. Indian Chem. Soc., 1985, 62, 513. [all data]
Adriaanse, Dekker, et al., 1964
Adriaanse, N.; Dekker, H.; Coops, J.,
Some Physical Constants of Normal, Saturated Fatty Acids and Their Methyl Esters,
Recl. Trav. Chim. Pays-Bas, 1964, 83, 557. [all data]
Aldrich Chemical Company Inc., 1990
Aldrich Chemical Company Inc.,
Catalog Handbook of Fine Chemicals, Aldrich Chemical Company, Inc., Milwaukee WI, 1990, 1. [all data]
Weast and Grasselli, 1989
CRC Handbook of Data on Organic Compounds, 2nd Editon, Weast,R.C and Grasselli, J.G., ed(s)., CRC Press, Inc., Boca Raton, FL, 1989, 1. [all data]
van Genderen, van Miltenburg, et al., 2002
van Genderen, Aad C.G.; van Miltenburg, J. Cees; Blok, Jacobus G.; van Bommel, Mark J.; van Ekeren, Paul J.; van den Berg, Gerrit J.K.; Oonk, Harry A.J.,
Liquid--vapour equilibria of the methyl esters of alkanoic acids: vapour pressures as a function of temperature and standard thermodynamic function changes,
Fluid Phase Equilibria, 2002, 202, 1, 109-120, https://doi.org/10.1016/S0378-3812(02)00097-3
. [all data]
Stephenson and Malanowski, 1987
Stephenson, Richard M.; Malanowski, Stanislaw,
Handbook of the Thermodynamics of Organic Compounds, 1987, https://doi.org/10.1007/978-94-009-3173-2
. [all data]
Rose and Schrodt, 1963
Rose, Arthur; Schrodt, Verle N.,
Correlation and Prediction of Vapor Pressures of Homologs. Use of Structure Parameters and Gas Chromatography Data.,
J. Chem. Eng. Data, 1963, 8, 1, 9-13, https://doi.org/10.1021/je60016a002
. [all data]
Hanai and Hong, 1989
Hanai, T.; Hong, C.,
Structure-retention correlation in CGC,
J. Hi. Res. Chromatogr., 1989, 12, 5, 327-332, https://doi.org/10.1002/jhrc.1240120517
. [all data]
Haken and Korhonen, 1984
Haken, J.K.; Korhonen, I.O.O.,
Gas chromatography of homologous esters. XXV. Capillary column studies of monochlorinated C5-C18 n-carboxylic esters,
J. Chromatogr., 1984, 298, 89-100, https://doi.org/10.1016/S0021-9673(01)92697-4
. [all data]
Ohnishi and Shibamoto, 1984
Ohnishi, S.; Shibamoto, T.,
Volatile compounds from heated beef fat and beef fat with glycine,
J. Agric. Food Chem., 1984, 32, 5, 987-992, https://doi.org/10.1021/jf00125a008
. [all data]
Pino, Mesa, et al., 2005
Pino, J.A.; Mesa, J.; Muñoz, Y.; Martí, M.P.; Marbot, R.,
Volatile components from mango (Mangifera indica L.) cultivars,
J. Agric. Food Chem., 2005, 53, 6, 2213-2223, https://doi.org/10.1021/jf0402633
. [all data]
Rostad and Pereira, 1986
Rostad, C.E.; Pereira, W.E.,
Kovats and Lee retention indices determined by gas chromatography/mass spectrometry for organic compounds of environmental interest,
J. Hi. Res. Chromatogr. Chromatogr. Comm., 1986, 9, 6, 328-334, https://doi.org/10.1002/jhrc.1240090603
. [all data]
Tret'yakov, 2008
Tret'yakov, K.V.,
Retention Data. NIST Mass Spectrometry Data Center., NIST Mass Spectrometry Data Center, 2008. [all data]
Peng, 2000
Peng, C.T.,
Prediction of retention indices. V. Influence of electronic effects and column polarity on retention index,
J. Chromatogr. A, 2000, 903, 1-2, 117-143, https://doi.org/10.1016/S0021-9673(00)00901-8
. [all data]
Dib, Bendahou, et al., 2010
Dib, M.A.; Bendahou, M.; Bendiabdellah, A.; Djabou, N.; Allali, H.; Tabti, B.; Paolini, J.; Costa, J.,
Partial chemical composition and antimicrobial activity of Daucus crinitus Desf. extracts,
Grasas y Aceites, 2010, 61, 3, 271-278, https://doi.org/10.3989/gya.122609
. [all data]
Bousaada, Ammar, et al., 2008
Bousaada, O.; Ammar, S.; Saidana, D.; Chriaa, J.; Chraif, I.; Daami, M.; Helal, A.N.; Mighri, Z.,
Chemical composition and antimicrobial activity of volatile components from capitula and aerial parts of Rhaponticum acaule DC growing wild in Tunisia,
Microbiol. Res., 2008, 163, 1, 87-95, https://doi.org/10.1016/j.micres.2007.02.010
. [all data]
Dickschat, Bode, et al., 2005
Dickschat, J.S.; Bode, H.B.; Kroppenstedt, R.M.; Müller, R.; Schulz, S.,
Biosynthesis of iso-fatty acids in myxobacteria,
Org. Biomol. Chem., 2005, 3, 15, 2824-2831, https://doi.org/10.1039/b504889c
. [all data]
Amijee, Cheung, et al., 1996
Amijee, M.; Cheung, J.; Wells, R.J.,
Direct on-column derivatisation in gas chromatography. III. On-column benzylation reagents and the development of 3,5-bis(trifluoromethyl)benzyl-dimethylphenylammonium fluoride, an efficient new on-column derivatisation reagent,
J. Chromatogr. A, 1996, 738, 1, 57-72, https://doi.org/10.1016/0021-9673(96)00088-X
. [all data]
Guy and Vernin, 1996
Guy, I.; Vernin, G.,
Minor compounds from Cistus ladaniferus L. essential oil from esterel. 2. Acids and phenols,
J. Essent. Oil Res., 1996, 8, 4, 455-462, https://doi.org/10.1080/10412905.1996.9700666
. [all data]
Okumura, 1991
Okumura, T.,
retention indices of environmental chemicals on methyl silicone capillary column,
Journal of Environmental Chemistry (Japan), 1991, 1, 2, 333-358, https://doi.org/10.5985/jec.1.333
. [all data]
Vinogradov, 2004
Vinogradov, B.A.,
Production, composition, properties and application of essential oils, 2004, retrieved from http://viness.narod.ru. [all data]
Welke, Manfroi, et al., 2012
Welke, J.E.; Manfroi, V.; Zanus, M.; Lazarotto, M.; Zini, C.A.,
Characterization of the volatile profile of Brazilian merlot wines through comprehensive two dimensional gas chromatography time-of-flight mass spectrometric detection,
J. Chromatogr. A, 2012, 1226, 124-139, https://doi.org/10.1016/j.chroma.2012.01.002
. [all data]
Eckel and Kind, 2003
Eckel, W.P.; Kind, T.,
Use of boiling point-Lee retention index correlation for rapid review of gas chromatography-mass spectrometry data,
Anal. Chim. Acta., 2003, 494, 1-2, 235-243, https://doi.org/10.1016/j.aca.2003.08.003
. [all data]