4,4-Dipropylheptane
- Formula: C13H28
- Molecular weight: 184.3614
- IUPAC Standard InChIKey: ULEPZYFBCDJENO-UHFFFAOYSA-N
- CAS Registry Number: 17312-72-0
- Chemical structure:
View 3d structure (requires JavaScript / HTML 5) - Permanent link for this species. Use this link for bookmarking this species for future reference.

Phase change data

Data compiled by: Thermodynamics Research Center, NIST Boulder Laboratories, Chris Muzny director
Quantity | Value | Units | Method | Reference | Comment |
---|---|---|---|---|---|
Tfus | 247. | K | N/A | Petrov and Chernyshev, 1954 | Uncertainty assigned by TRC = 2. K |
Tfus | 246.7 | K | N/A | Petrov, 1953 | Uncertainty assigned by TRC = 3. K |
Tfus | 246.7 | K | N/A | Petrov and Chernyshev, 1952 | Uncertainty assigned by TRC = 2. K |

References

Petrov and Chernyshev, 1954
Petrov, A.D.; Chernyshev, J.K.,
Ref. Zh. Khim., 1954, 1954, 23354. [all data]
Petrov, 1953
Petrov, A.D.,
Mechanism of Wurtz-Grignard Reaction,
Problemy Mekhanizma Org. Reaktsit, Akad. +Nauk Ukr. S.S.R., 1953, 1953, 113. [all data]
Petrov and Chernyshev, 1952
Petrov; Chernyshev, J.K.,
Izv. Akad. Nauk SSSR, 1952, 1952, 1082. [all data]