Undecane, 4-ethyl-
- Formula: C13H28
- Molecular weight: 184.3614
- IUPAC Standard InChIKey: MVVIXMNNJWGWHB-UHFFFAOYSA-N
- CAS Registry Number: 17312-59-3
- Chemical structure:
View 3d structure (requires JavaScript / HTML 5) - Permanent link for this species. Use this link for bookmarking this species for future reference.

Phase change data

Data compiled by: Thermodynamics Research Center, NIST Boulder Laboratories, Chris Muzny director
Quantity | Value | Units | Method | Reference | Comment |
---|---|---|---|---|---|
Tboil | 497.6 | K | N/A | Gibbons, 1941 | Uncertainty assigned by TRC = 2. K |

Kovats' RI, non-polar column, isothermal

View large format table.

Column type Active phase Temperature (C) I Reference Comment
CapillaryApiezon L100.1242.Rappoport and Gäumann, 1973

References

Gibbons, 1941
Gibbons, L.C.,
, Ph.D. Thesis, Ohio State Univ., Columbus, OH, 1941. [all data]