Decane, 2,5-dimethyl-
- Formula: C12H26
- Molecular weight: 170.3348
- IUPAC Standard InChIKey: DQHKBYZSYRJBMD-UHFFFAOYSA-N
- CAS Registry Number: 17312-50-4
- Chemical structure:
View 3d structure (requires JavaScript / HTML 5) - Other names: 2,5-Dimethyldecane

Phase change data

Data compiled by: Thermodynamics Research Center, NIST Boulder Laboratories, Chris Muzny director
Quantity | Value | Units | Method | Reference | Comment |
---|---|---|---|---|---|
Tfus | 211.3 | K | N/A | Petrov, Sergienko, et al., 1959 | Uncertainty assigned by TRC = 2. K |

Van Den Dool and Kratz RI, non-polar column, temperature ramp

Column type | Active phase | I | Reference | Comment |
---|---|---|---|---|
Capillary | Cross-Linked Methylsilicone | 1118. | Khorasheh, Gray, et al., 1989 | 5. K/min; Tstart: 40. C; Tend: 300. C |

Normal alkane RI, non-polar column, custom temperature program

Column type | Active phase | I | Reference | Comment |
---|---|---|---|---|
Capillary | Squalane | 1112. | Petrov, 1984 | Program: not specified |

References

Petrov, Sergienko, et al., 1959
Petrov, A.A.; Sergienko, S.R.; Tsedilina, A.L.; Nechitailo, N.A.; Sanin, P.I.; Nikitskaya, E.A.,
Izv. Akad. Nauk SSSR, 1959, 1959, 1421-4. [all data]
Khorasheh, Gray, et al., 1989
Khorasheh, F.; Gray, M.R.; Selucky, M.L.,
Correlation for Kováts retention index of C9-C26 monoalkyl and polymethyl alkanes and alkenes,
J. Chromatogr., 1989, 481, 1-16, https://doi.org/10.1016/S0021-9673(01)96747-0
. [all data]
Petrov, 1984
Petrov, A.A.,
Hydrocarbons of petroleum, Nauka (publishing house), Moscow, 1984, 263. [all data]