4-ethyl-4-propylheptane
- Formula: C12H26
- Molecular weight: 170.3348
- IUPAC Standard InChIKey: JTZJHTZCYBYCSZ-UHFFFAOYSA-N
- CAS Registry Number: 17312-43-5
- Chemical structure:
View 3d structure (requires JavaScript / HTML 5) - Permanent link for this species. Use this link for bookmarking this species for future reference.

Phase change data

Data compiled by: Thermodynamics Research Center, NIST Boulder Laboratories, Chris Muzny director
Quantity | Value | Units | Method | Reference | Comment |
---|---|---|---|---|---|
Tfus | 203. | K | N/A | Petrov, 1953 | Uncertainty assigned by TRC = 5. K |

References

Petrov, 1953
Petrov, A.D.,
Mechanism of Wurtz-Grignard Reaction,
Problemy Mekhanizma Org. Reaktsit, Akad. +Nauk Ukr. S.S.R., 1953, 1953, 113. [all data]