Butanoic acid, 2-methyl-, (2S)-
- Formula: C5H10O2
- Molecular weight: 102.1317
- IUPAC Standard InChIKey: WLAMNBDJUVNPJU-SCSAIBSYSA-N
- CAS Registry Number: 1730-91-2
- Chemical structure:
View 3d structure (requires JavaScript / HTML 5) - Stereoisomers:
- Other names: (S)-(+)-2-Methylbutyric acid; Butanoic acid, 2-methyl-, (S)-

Phase change data

Data compiled by: Robert L. Brown and Stephen E. Stein
Reduced pressure boiling point
Tboil (K) | Pressure (bar) | Reference |
---|---|---|
351.2 | 0.020 | Aldrich Chemical Company Inc., 1990 |

References

Aldrich Chemical Company Inc., 1990
Aldrich Chemical Company Inc.,
Catalog Handbook of Fine Chemicals, Aldrich Chemical Company, Inc., Milwaukee WI, 1990, 1. [all data]