Undecane, 6-methyl-

Phase change data

Data compiled by: Thermodynamics Research Center, NIST Boulder Laboratories, Chris Muzny director

Quantity Value Units Method Reference Comment
Tfus209.3KN/APetrov, Sergienko, et al., 1959Uncertainty assigned by TRC = 2. K

In addition to the Thermodynamics Research Center (TRC) data available from this site, much more physical and chemical property data is available from the following TRC products:

Kovats' RI, non-polar column, isothermal

View large format table.

Column type Active phase Temperature (C) I Reference Comment
CapillarySqualane100.1152.Heinzen, Soares, et al., 1999
CapillaryOV-160.1157.Nijs and Jacobs, 1981He; Column length: 150. m; Column diameter: 0.50 mm
CapillarySqualane100.1152.Mitra, Mohan, et al., 1974H2; Column length: 50. m; Column diameter: 0.2 mm
CapillaryApiezon L100.1148.Rappoport and Gäumann, 1973
CapillarySqualane100.1151.8Schomburg and Dielmann, 1973Column length: 100. m; Column diameter: 0.25 mm
CapillaryDC-200100.1152.Schomburg and Henneberg, 1968He; Column length: 100. m; Column diameter: 0.25 mm

Kovats' RI, non-polar column, temperature ramp

View large format table.

Column type Active phase I Reference Comment
CapillarySE-541154.Rembold, Wallner, et al., 198930. m/0.25 mm/0.25 μm, He, 0. C @ 12. min, 12. K/min; Tend: 250. C

Normal alkane RI, non-polar column, temperature ramp

View large format table.

Column type Active phase I Reference Comment
CapillaryHP-5 MS1155.Kotowska, Zalikowski, et al., 201230. m/0.25 mm/0.25 μm, Helium, 35. C @ 5. min, 3. K/min, 300. C @ 15. min
CapillaryOV-11156.1Krkosova, Kubinec, et al., 2007100. m/0.32 mm/0.25 μm, Helium, 5. K/min, 310. C @ 5. min; Tstart: 30. C
CapillaryCP Sil 5 CB1156.Höld, Schouten, et al., 199825. m/0.32 mm/0.45 μm, 0. C @ 5. min, 3. K/min, 300. C @ 10. min

Normal alkane RI, non-polar column, custom temperature program

View large format table.

Column type Active phase I Reference Comment
CapillaryHP-5 MS1154.Kotowska, Zalikowski, et al., 201230. m/0.25 mm/0.25 μm, Helium; Program: not specified
CapillaryPolydimethyl siloxane1152.Junkes, Castanho, et al., 2003Program: not specified
CapillarySqualane1151.Petrov, 1984Program: not specified
CapillaryApiezon L1147.Shlyakhov, 1984Program: not specified

References

Petrov, Sergienko, et al., 1959
Petrov, A.A.; Sergienko, S.R.; Nechitailo, N.A.; Tsedilina, A.L., Izv. Akad. Nauk SSSR, 1959, 1959, 1091-7. [all data]

Heinzen, Soares, et al., 1999
Heinzen, V.E.F.; Soares, M.F.; Yunes, R.A., Semi-empirical topological method for the prediction of the chromatographic retention of cis- and trans-alkene isomers and alkanes, J. Chromatogr. A, 1999, 849, 2, 495-506, https://doi.org/10.1016/S0021-9673(99)00530-0 . [all data]

Nijs and Jacobs, 1981
Nijs, H.H.; Jacobs, P.A., On-Line Single Run Analysis of Effluents from a Fischer-Tropsch Reactor, J. Chromatogr. Sci., 1981, 19, 1, 40-45, https://doi.org/10.1093/chromsci/19.1.40 . [all data]

Mitra, Mohan, et al., 1974
Mitra, G.D.; Mohan, G.; Sinha, A., Gas chromatographic analysis of complex hydrocarbon mixtures, J. Chromatogr. A, 1974, 91, 633-648, https://doi.org/10.1016/S0021-9673(01)97944-0 . [all data]

Rappoport and Gäumann, 1973
Rappoport, S.; Gäumann, T., 114. L'indice de rétention des alcanes isomères en chromatographie en phase gazeuse, Helv. Chim. Acta, 1973, 56, 3, 1145-1158, https://doi.org/10.1002/hlca.19730560338 . [all data]

Schomburg and Dielmann, 1973
Schomburg, G.; Dielmann, G., Identification by means of retention parameters, J. Chromatogr. Sci., 1973, 11, 3, 151-159, https://doi.org/10.1093/chromsci/11.3.151 . [all data]

Schomburg and Henneberg, 1968
Schomburg, G.; Henneberg, D., Analyse von i-Paraffingemischen aus ?methylene insertion?-bzw. ?methylene-d2 insertion?-Reaktionen mit einer Kombination Capillar-Gas-Chromatographie/Massenspectrometrie, Anal. Chem., 1968, 236, 1, 279-294, https://doi.org/10.1007/BF00503281 . [all data]

Rembold, Wallner, et al., 1989
Rembold, H.; Wallner, P.; Nitz, S.; Kollmannsberger, H.; Drawert, F., Volatile components of chickpea (Cicer arietinum L.) seed, J. Agric. Food Chem., 1989, 37, 3, 659-662, https://doi.org/10.1021/jf00087a018 . [all data]

Kotowska, Zalikowski, et al., 2012
Kotowska, U.; Zalikowski, M.; Isidorov, V.A., HS-SPME/GC-MS analysis of volatile and semi-volatile organic compounds emitted from municipal sewage sludge, Environ. Monit. Asses., 2012, 184, 5, 2893-2907, https://doi.org/10.1007/s10661-011-2158-8 . [all data]

Krkosova, Kubinec, et al., 2007
Krkosova, Z.; Kubinec, R.; Addova, G.; Jurdakova, H.; Blasko, J.; Ostrovsky, I.; Sojak, L., Gas chromatographic - mass spectrometric characterization of monomethylalkanes from fuel diesel, Petroleum Coal, 2007, 49, 3, 51-62. [all data]

Höld, Schouten, et al., 1998
Höld, I.M.; Schouten, S.; van Kaam-Peters, H.M.E.; Sinninghe Damsté, J.S., Recognition of n-alkyl and isoprenoid algaenans in marine sediments by stable carbon isotopic analysis of pyrolysis products of kerogens, Org. Geochem., 1998, 28, 3-4, 179-194, https://doi.org/10.1016/S0146-6380(97)00130-7 . [all data]

Junkes, Castanho, et al., 2003
Junkes, B.S.; Castanho, R.D.M.; Amboni, C.; Yunes, R.A.; Heinzen, V.E.F., Semiempirical Topological Index: A Novel Molecular Descriptor for Quantitative Structure-Retention Relationship Studies, Internet Electronic Journal of Molecular Design, 2003, 2, 1, 33-49. [all data]

Petrov, 1984
Petrov, A.A., Hydrocarbons of petroleum, Nauka (publishing house), Moscow, 1984, 263. [all data]

Shlyakhov, 1984
Shlyakhov, A.F., Gas chromatography in organic geochemistry, Nedra, Moscow, 1984, 221. [all data]