4,4-diethylheptane
- Formula: C11H24
- Molecular weight: 156.3083
- IUPAC Standard InChIKey: WDTMGYSKSAMSPF-UHFFFAOYSA-N
- CAS Registry Number: 17302-21-5
- Chemical structure:
View 3d structure (requires JavaScript / HTML 5) - Permanent link for this species. Use this link for bookmarking this species for future reference.

Phase change data

Data compiled by: Thermodynamics Research Center, NIST Boulder Laboratories, Chris Muzny director
Quantity | Value | Units | Method | Reference | Comment |
---|---|---|---|---|---|
Tboil | 456.3 | K | N/A | Anonymous, 1955 | Uncertainty assigned by TRC = 0.6 K |
Tboil | 456.6 | K | N/A | Anonymous, 1955 | Uncertainty assigned by TRC = 0.6 K |

References

Anonymous, 1955
Anonymous, R.,
, Am. Pet. Inst. Res. Proj. 45, Tech. Rep. 14, No. 1, Ohio State Univ., 1955. [all data]