Undecane, 3,7-dimethyl-
- Formula: C13H28
- Molecular weight: 184.3614
- IUPAC Standard InChIKey: QQWXDSCYXKZATG-UHFFFAOYSA-N
- CAS Registry Number: 17301-29-0
- Chemical structure:
View 3d structure (requires JavaScript / HTML 5) - Other names: 3,7-Dimethylundecane

Kovats' RI, non-polar column, isothermal

Column type | Active phase | Temperature (C) | I | Reference | Comment |
---|---|---|---|---|---|
Capillary | DC-200 | 100. | 1218. | Schomburg and Henneberg, 1968 | He; Column length: 100. m; Column diameter: 0.25 mm |

Kovats' RI, non-polar column, custom temperature program

Column type | Active phase | I | Reference | Comment |
---|---|---|---|---|
Capillary | DC-200 | 1223. | Schomburg and Henneberg, 1968 | He; Column length: 100. m; Column diameter: 0.25 mm; Program: not specified |

Normal alkane RI, non-polar column, temperature ramp

Column type | Active phase | I | Reference | Comment |
---|---|---|---|---|
Capillary | HP-5 MS | 1221. | Kotowska, Zalikowski, et al., 2012 | 30. m/0.25 mm/0.25 μm, Helium, 35. C @ 5. min, 3. K/min, 300. C @ 15. min |

Normal alkane RI, non-polar column, custom temperature program

Column type | Active phase | I | Reference | Comment |
---|---|---|---|---|
Capillary | HP-5 MS | 1222. | Kotowska, Zalikowski, et al., 2012 | 30. m/0.25 mm/0.25 μm, Helium; Program: not specified |
Capillary | Squalane | 1222. | Petrov, 1984 | Program: not specified |

References

Schomburg and Henneberg, 1968
Schomburg, G.; Henneberg, D.,
Analyse von i-Paraffingemischen aus ?methylene insertion?-bzw. ?methylene-d2 insertion?-Reaktionen mit einer Kombination Capillar-Gas-Chromatographie/Massenspectrometrie,
Anal. Chem., 1968, 236, 1, 279-294, https://doi.org/10.1007/BF00503281
. [all data]
Kotowska, Zalikowski, et al., 2012
Kotowska, U.; Zalikowski, M.; Isidorov, V.A.,
HS-SPME/GC-MS analysis of volatile and semi-volatile organic compounds emitted from municipal sewage sludge,
Environ. Monit. Asses., 2012, 184, 5, 2893-2907, https://doi.org/10.1007/s10661-011-2158-8
. [all data]
Petrov, 1984
Petrov, A.A.,
Hydrocarbons of petroleum, Nauka (publishing house), Moscow, 1984, 263. [all data]