Undecane, 2,10-dimethyl-
- Formula: C13H28
- Molecular weight: 184.3614
- IUPAC Standard InChIKey: AZUSLLNYWXCPIZ-UHFFFAOYSA-N
- CAS Registry Number: 17301-27-8
- Chemical structure:
View 3d structure (requires JavaScript / HTML 5) - Other names: 2,10-Dimethylundecane

Phase change data

Data compiled by: Thermodynamics Research Center, NIST Boulder Laboratories, Chris Muzny director
Quantity | Value | Units | Method | Reference | Comment |
---|---|---|---|---|---|
Tboil | 491.4 | K | N/A | Gibbons, 1941 | Uncertainty assigned by TRC = 1.5 K |

Kovats' RI, non-polar column, isothermal

View large format table.

Column type Active phase Temperature (C) I Reference Comment
CapillarySqualane100.1226.Mitra, Mohan, et al., 1974H2; Column length: 50. m; Column diameter: 0.2 mm
CapillarySqualane100.1227.3Schomburg and Dielmann, 1973Column length: 100. m; Column diameter: 0.25 mm
CapillaryDC-200100.1227.Schomburg and Henneberg, 1968He; Column length: 100. m; Column diameter: 0.25 mm

Kovats' RI, non-polar column, custom temperature program

View large format table.

Column type Active phase I Reference Comment
CapillaryDC-2001228.Schomburg and Henneberg, 1968He; Column length: 100. m; Column diameter: 0.25 mm; Program: not specified

Van Den Dool and Kratz RI, polar column, temperature ramp

View large format table.

Column type Active phase I Reference Comment
CapillaryDB-Wax1254.Shiratsuchi, Shimoda, et al., 199460. m/0.25 mm/0.25 μm, He, 2. K/min, 230. C @ 60. min; Tstart: 50. C

References

Gibbons, 1941
Gibbons, L.C.,
, Ph.D. Thesis, Ohio State Univ., Columbus, OH, 1941. [all data]