Diacetoxynorbornane
- Formula: C11H16O4
- Molecular weight: 212.2423
- IUPAC Standard InChIKey: LNTSWTDQYLJUEX-UHFFFAOYSA-N
- CAS Registry Number: 17290-00-5
- Chemical structure:
View 3d structure (requires JavaScript / HTML 5) - Permanent link for this species. Use this link for bookmarking this species for future reference.

Phase change data

Data compiled by: Robert L. Brown and Stephen E. Stein
Reduced pressure boiling point
Tboil (K) | Pressure (bar) | Reference |
---|---|---|
415. to 416. | 0.019 | Frinton Laboratories Inc., 1986 |

References

Frinton Laboratories Inc., 1986
Frinton Laboratories Inc.,
Catalog Number 11, Frinton Laboratories Inc., Vineland, NJ, 1986, 99. [all data]