Benzene, 1,1'-pentylidenebis-
- Formula: C17H20
- Molecular weight: 224.3407
- IUPAC Standard InChIKey: GSGNVNZDHCKRGI-UHFFFAOYSA-N
- CAS Registry Number: 1726-12-1
- Chemical structure:
View 3d structure (requires JavaScript / HTML 5) - Other names: 1,1-Diphenylpentane

Condensed phase thermochemistry data

Data compiled by: Hussein Y. Afeefy, Joel F. Liebman, and Stephen E. Stein
Quantity | Value | Units | Method | Reference | Comment |
---|---|---|---|---|---|
ΔcH°liquid | -9602. | kJ/mol | Ccb | Serijan and Wise, 1951 | Corresponding ΔfHºliquid = 54. kJ/mol (simple calculation by NIST; no Washburn corrections) |

Phase change data

Data compiled by: Thermodynamics Research Center, NIST Boulder Laboratories, Chris Muzny director
Quantity | Value | Units | Method | Reference | Comment |
---|---|---|---|---|---|
Tboil | 581.04 | K | N/A | Serijan and Wise, 1951, 2 | Uncertainty assigned by TRC = 0.3 K |
Quantity | Value | Units | Method | Reference | Comment |
Tfus | 261.09 | K | N/A | Serijan and Wise, 1951, 2 | Uncertainty assigned by TRC = 0.05 K |

References

Serijan and Wise, 1951
Serijan, K.T.; Wise, P.H.,
Dicyclic hydrocarbons. IV. Synthesis and physical properties of α,α- and α,omega-diphenyl- and dicyclohexyl- pentanes and hexanes,
J. Am. Chem. Soc., 1951, 73, 5191-5193. [all data]
Serijan and Wise, 1951, 2
Serijan, K.T.; Wise, P.H.,
Dicyclic hydrocarboms. IV. Synthesis and Physical properties of alpha,alpha - and alpha,omega-diphenyl- and dicyclohexyl- pentanes and hexanes,
J. Am. Chem. Soc., 1951, 73, 5191. [all data]