3-Chlorothiophene
- Formula: C4H3ClS
- Molecular weight: 118.585
- IUPAC Standard InChIKey: QUBJDMPBDURTJT-UHFFFAOYSA-N
- CAS Registry Number: 17249-80-8
- Chemical structure:
View 3d structure (requires JavaScript / HTML 5) - Other names: Thiophene, 3-chloro-

Phase change data

Data compiled by: William E. Acree, Jr., James S. Chickos
Enthalpy of fusion
ΔfusH (kJ/mol) | Temperature (K) | Method | Reference | Comment |
---|---|---|---|---|
9.39 | 214.2 | AC | Fujimori, 2004 | Based on data from 13. to 300. K. |

Gas phase ion energetics data

Data compiled by: Sharon G. Lias and Joel F. Liebman
Ionization energy determinations
IE (eV) | Method | Reference |
---|---|---|
8.92 | PE | Veszpremi, Nyulaszi, et al., 1988 |

References

Fujimori, 2004
Fujimori, H.,
Glass Transition in the Stable Crystalline State of 3-Chlorothiophene, 2004, 685-686, https://doi.org/10.1063/1.1764261
. [all data]